﻿2026-08-18T00:51:19.3195957Z Current runner version: '2.336.0'
2026-08-18T00:51:19.3202121Z Runner name: 'hfenduleam'
2026-08-18T00:51:19.3202805Z Runner group name: 'Default'
2026-08-18T00:51:19.3203579Z Machine name: 'HFENDULEAM'
2026-08-18T00:51:19.3208702Z ##[group]GITHUB_TOKEN Permissions
2026-08-18T00:51:19.3210241Z Actions: write
2026-08-18T00:51:19.3210589Z ArtifactMetadata: write
2026-08-18T00:51:19.3210946Z Attestations: write
2026-08-18T00:51:19.3211331Z Checks: write
2026-08-18T00:51:19.3211734Z CodeQuality: write
2026-08-18T00:51:19.3212069Z Contents: write
2026-08-18T00:51:19.3212429Z CopilotRequests: write
2026-08-18T00:51:19.3212853Z Deployments: write
2026-08-18T00:51:19.3213196Z Discussions: write
2026-08-18T00:51:19.3213519Z Drives: write
2026-08-18T00:51:19.3213831Z Issues: write
2026-08-18T00:51:19.3214149Z Metadata: read
2026-08-18T00:51:19.3214463Z Models: read
2026-08-18T00:51:19.3214775Z Packages: write
2026-08-18T00:51:19.3215089Z Pages: write
2026-08-18T00:51:19.3215631Z PullRequests: write
2026-08-18T00:51:19.3216020Z RepositoryProjects: write
2026-08-18T00:51:19.3216378Z SecurityEvents: write
2026-08-18T00:51:19.3216719Z Statuses: write
2026-08-18T00:51:19.3217036Z VulnerabilityAlerts: read
2026-08-18T00:51:19.3217411Z ##[endgroup]
2026-08-18T00:51:19.3218708Z Secret source: Actions
2026-08-18T00:51:19.3219304Z Prepare workflow directory
2026-08-18T00:51:19.3612076Z Prepare all required actions
2026-08-18T00:51:19.3643353Z Getting action download info
2026-08-18T00:51:19.6654143Z Download action repository 'actions/checkout@v5' (SHA:fbc6f3992d24b796d5a048ff273f7fcc4a7b6c09)
2026-08-18T00:51:20.2157544Z Complete job name: unit (self-hosted, Windows, hfenduleam)
2026-08-18T00:51:20.2968502Z ##[group]Run $floorBytes = 32GB
2026-08-18T00:51:20.2969055Z [36;1m$floorBytes = 32GB[0m
2026-08-18T00:51:20.2969507Z [36;1m$drive = (Get-Item $env:GITHUB_WORKSPACE).PSDrive[0m
2026-08-18T00:51:20.2969993Z [36;1m$freeBytes = [int64]$drive.Free[0m
2026-08-18T00:51:20.2970627Z [36;1mWrite-Host "disk preflight: drive=$($drive.Root) free_bytes=$freeBytes floor_bytes=$floorBytes"[0m
2026-08-18T00:51:20.2971304Z [36;1mif ($freeBytes -lt $floorBytes) {[0m
2026-08-18T00:51:20.2971950Z [36;1m  Write-Error "RESOURCE=disk drive=$($drive.Root) free_bytes=$freeBytes floor_bytes=$floorBytes"[0m
2026-08-18T00:51:20.2972538Z [36;1m  exit 1[0m
2026-08-18T00:51:20.2972844Z [36;1m}[0m
2026-08-18T00:51:20.2980674Z shell: C:\Program Files\PowerShell\7\pwsh.EXE -command ". '{0}'"
2026-08-18T00:51:20.2981328Z ##[endgroup]
2026-08-18T00:51:20.7320617Z disk preflight: drive=C:\ free_bytes=104327630848 floor_bytes=34359738368
2026-08-18T00:51:20.8450751Z ##[group]Run actions/checkout@v5
2026-08-18T00:51:20.8451471Z with:
2026-08-18T00:51:20.8451927Z   repository: BigscreenVR/spt-bs-core
2026-08-18T00:51:20.8455229Z   token: ***
2026-08-18T00:51:20.8455526Z   ssh-strict: true
2026-08-18T00:51:20.8455890Z   ssh-user: git
2026-08-18T00:51:20.8456309Z   persist-credentials: true
2026-08-18T00:51:20.8456806Z   clean: true
2026-08-18T00:51:20.8457215Z   sparse-checkout-cone-mode: true
2026-08-18T00:51:20.8457753Z   fetch-depth: 1
2026-08-18T00:51:20.8458211Z   fetch-tags: false
2026-08-18T00:51:20.8458743Z   show-progress: true
2026-08-18T00:51:20.8459164Z   lfs: false
2026-08-18T00:51:20.8459555Z   submodules: false
2026-08-18T00:51:20.8459898Z   set-safe-directory: true
2026-08-18T00:51:20.8460282Z   allow-unsafe-pr-checkout: false
2026-08-18T00:51:20.8460713Z ##[endgroup]
2026-08-18T00:51:21.0469228Z Syncing repository: BigscreenVR/spt-bs-core
2026-08-18T00:51:21.0470404Z ##[group]Getting Git version info
2026-08-18T00:51:21.0471005Z Working directory is 'C:\actions-runner\_work\spt-bs-core\spt-bs-core'
2026-08-18T00:51:21.0672502Z [command]"C:\Program Files\Git\cmd\git.exe" version
2026-08-18T00:51:21.0919929Z git version 2.43.0.windows.1
2026-08-18T00:51:21.0943051Z ##[endgroup]
2026-08-18T00:51:21.0951502Z Copying 'C:\Users\decid\.gitconfig' to 'C:\actions-runner\_work\_temp\0df1241f-7f30-4486-8089-a256a24df4a4\.gitconfig'
2026-08-18T00:51:21.0966208Z Temporarily overriding HOME='C:\actions-runner\_work\_temp\0df1241f-7f30-4486-8089-a256a24df4a4' before making global git config changes
2026-08-18T00:51:21.0967132Z Adding repository directory to the temporary git global config as a safe directory
2026-08-18T00:51:21.0971382Z [command]"C:\Program Files\Git\cmd\git.exe" config --global --add safe.directory C:\actions-runner\_work\spt-bs-core\spt-bs-core
2026-08-18T00:51:21.1728155Z [command]"C:\Program Files\Git\cmd\git.exe" config --local --get remote.origin.url
2026-08-18T00:51:21.1951984Z https://github.com/BigscreenVR/spt-bs-core
2026-08-18T00:51:21.1977262Z ##[group]Removing previously created refs, to avoid conflicts
2026-08-18T00:51:21.1981712Z [command]"C:\Program Files\Git\cmd\git.exe" rev-parse --symbolic-full-name --verify --quiet HEAD
2026-08-18T00:51:21.2210942Z HEAD
2026-08-18T00:51:21.3007538Z ##[endgroup]
2026-08-18T00:51:21.3010369Z [command]"C:\Program Files\Git\cmd\git.exe" submodule status
2026-08-18T00:51:22.1478447Z ##[group]Cleaning the repository
2026-08-18T00:51:22.1482943Z [command]"C:\Program Files\Git\cmd\git.exe" clean -ffdx
2026-08-18T00:51:31.0524259Z Removing target/
2026-08-18T00:51:31.0553809Z [command]"C:\Program Files\Git\cmd\git.exe" reset --hard HEAD
2026-08-18T00:51:31.2288268Z HEAD is now at ca2c313af Merge cf1108a2807d7d96d03de5267175ddeb30be30a7 into fa8c22293a8345d14455255e7de34d1d73e6ca57
2026-08-18T00:51:31.2314779Z ##[endgroup]
2026-08-18T00:51:31.2319114Z ##[group]Disabling automatic garbage collection
2026-08-18T00:51:31.2324920Z [command]"C:\Program Files\Git\cmd\git.exe" config --local gc.auto 0
2026-08-18T00:51:31.2617409Z ##[endgroup]
2026-08-18T00:51:31.2618019Z ##[group]Setting up auth
2026-08-18T00:51:31.2618650Z [command]"C:\Program Files\Git\cmd\git.exe" config --local --name-only --get-regexp core\.sshCommand
2026-08-18T00:51:31.3381432Z [command]"C:\Program Files\Git\cmd\git.exe" submodule foreach --recursive "sh -c \"git config --local --name-only --get-regexp 'core\.sshCommand' && git config --local --unset-all 'core.sshCommand' || :\""
2026-08-18T00:51:32.0407671Z [command]"C:\Program Files\Git\cmd\git.exe" config --local --name-only --get-regexp http\.https\:\/\/github\.com\/\.extraheader
2026-08-18T00:51:32.0652086Z [command]"C:\Program Files\Git\cmd\git.exe" submodule foreach --recursive "sh -c \"git config --local --name-only --get-regexp 'http\.https\:\/\/github\.com\/\.extraheader' && git config --local --unset-all 'http.https://github.com/.extraheader' || :\""
2026-08-18T00:51:32.7820092Z [command]"C:\Program Files\Git\cmd\git.exe" config --local --name-only --get-regexp ^includeIf\.gitdir:
2026-08-18T00:51:32.8082276Z [command]"C:\Program Files\Git\cmd\git.exe" submodule foreach --recursive "git config --local --show-origin --name-only --get-regexp remote.origin.url"
2026-08-18T00:51:33.3606178Z [command]"C:\Program Files\Git\cmd\git.exe" config --local http.https://github.com/.extraheader "AUTHORIZATION: basic ***"
2026-08-18T00:51:33.4372629Z ##[endgroup]
2026-08-18T00:51:33.4373243Z ##[group]Fetching the repository
2026-08-18T00:51:33.4381492Z [command]"C:\Program Files\Git\cmd\git.exe" -c protocol.version=2 fetch --no-tags --prune --no-recurse-submodules --depth=1 origin +a617dff57a471fa3682879910a35a2b47a8c7b48:refs/remotes/pull/146/merge
2026-08-18T00:51:34.8975570Z From https://github.com/BigscreenVR/spt-bs-core
2026-08-18T00:51:34.8976324Z  + ca2c313af...a617dff57 a617dff57a471fa3682879910a35a2b47a8c7b48 -> pull/146/merge  (forced update)
2026-08-18T00:51:34.9110374Z ##[endgroup]
2026-08-18T00:51:34.9110845Z ##[group]Determining the checkout info
2026-08-18T00:51:34.9111368Z ##[endgroup]
2026-08-18T00:51:34.9117119Z [command]"C:\Program Files\Git\cmd\git.exe" sparse-checkout disable
2026-08-18T00:51:34.9848435Z [command]"C:\Program Files\Git\cmd\git.exe" config --local --unset-all extensions.worktreeConfig
2026-08-18T00:51:35.0091054Z ##[group]Checking out the ref
2026-08-18T00:51:35.0095600Z [command]"C:\Program Files\Git\cmd\git.exe" checkout --progress --force refs/remotes/pull/146/merge
2026-08-18T00:51:35.1377436Z Warning: you are leaving 1 commit behind, not connected to
2026-08-18T00:51:35.1377948Z any of your branches:
2026-08-18T00:51:35.1378113Z 
2026-08-18T00:51:35.1378418Z   ca2c313af Merge cf1108a2807d7d96d03de5267175ddeb30be30a7 into fa8c22293a8345d14455255e7de34d1d73e6ca57
2026-08-18T00:51:35.1378971Z 
2026-08-18T00:51:35.1379178Z If you want to keep it by creating a new branch, this may be a good time
2026-08-18T00:51:35.1379633Z to do so with:
2026-08-18T00:51:35.1379786Z 
2026-08-18T00:51:35.1380007Z  git branch <new-branch-name> ca2c313af
2026-08-18T00:51:35.1380298Z 
2026-08-18T00:51:35.1380740Z HEAD is now at a617dff57 Merge af8e57785d479fac8d0726c9f7e2085e3ce26529 into fa8c22293a8345d14455255e7de34d1d73e6ca57
2026-08-18T00:51:35.1734976Z ##[endgroup]
2026-08-18T00:51:35.1739183Z [command]"C:\Program Files\Git\cmd\git.exe" log -1 --format=%H
2026-08-18T00:51:35.2399954Z a617dff57a471fa3682879910a35a2b47a8c7b48
2026-08-18T00:51:35.2884118Z ##[group]Run cargo build -p spt --bin translate_proof_fixture
2026-08-18T00:51:35.2884707Z [36;1mcargo build -p spt --bin translate_proof_fixture[0m
2026-08-18T00:51:35.2891604Z shell: C:\Program Files\PowerShell\7\pwsh.EXE -command ". '{0}'"
2026-08-18T00:51:35.2892009Z ##[endgroup]
2026-08-18T00:51:38.5317476Z    Compiling proc-macro2 v1.0.106
2026-08-18T00:51:38.5317973Z    Compiling quote v1.0.45
2026-08-18T00:51:38.5318313Z    Compiling unicode-ident v1.0.24
2026-08-18T00:51:38.5318588Z    Compiling cfg-if v1.0.4
2026-08-18T00:51:38.6852102Z    Compiling serde_core v1.0.228
2026-08-18T00:51:38.8127456Z    Compiling serde v1.0.228
2026-08-18T00:51:39.0872856Z    Compiling windows-link v0.2.1
2026-08-18T00:51:39.2237992Z    Compiling typenum v1.20.1
2026-08-18T00:51:39.2890410Z    Compiling windows-sys v0.61.2
2026-08-18T00:51:40.0793055Z    Compiling getrandom v0.3.4
2026-08-18T00:51:40.2575604Z    Compiling syn v2.0.117
2026-08-18T00:51:40.4281728Z    Compiling pin-project-lite v0.2.17
2026-08-18T00:51:40.5038569Z    Compiling portable-atomic v1.13.1
2026-08-18T00:51:40.9383197Z    Compiling version_check v0.9.5
2026-08-18T00:51:41.2221474Z    Compiling memchr v2.8.1
2026-08-18T00:51:41.3184024Z    Compiling jobserver v0.1.34
2026-08-18T00:51:41.6095591Z    Compiling shlex v2.0.1
2026-08-18T00:51:41.7733800Z    Compiling find-msvc-tools v0.1.9
2026-08-18T00:51:42.1538776Z    Compiling cc v1.2.63
2026-08-18T00:51:42.5590805Z    Compiling critical-section v1.2.0
2026-08-18T00:51:42.6796328Z    Compiling subtle v2.6.1
2026-08-18T00:51:42.8142913Z    Compiling smallvec v1.15.1
2026-08-18T00:51:43.1196202Z    Compiling futures-core v0.3.32
2026-08-18T00:51:43.2829534Z    Compiling equivalent v1.0.2
2026-08-18T00:51:43.3483227Z    Compiling generic-array v0.14.7
2026-08-18T00:51:43.5353894Z    Compiling itoa v1.0.18
2026-08-18T00:51:43.5853651Z    Compiling bytes v1.11.1
2026-08-18T00:51:43.8050942Z    Compiling semver v1.0.28
2026-08-18T00:51:44.1078166Z    Compiling rustc_version v0.4.1
2026-08-18T00:51:44.3272537Z    Compiling synstructure v0.13.2
2026-08-18T00:51:44.7553112Z    Compiling stable_deref_trait v1.2.1
2026-08-18T00:51:44.8169821Z    Compiling log v0.4.32
2026-08-18T00:51:44.8279663Z    Compiling crypto-common v0.1.7
2026-08-18T00:51:44.9116933Z    Compiling socket2 v0.6.4
2026-08-18T00:51:44.9769408Z    Compiling mio v1.2.1
2026-08-18T00:51:44.9835966Z    Compiling serde_derive v1.0.228
2026-08-18T00:51:45.3755791Z    Compiling zeroize_derive v1.4.3
2026-08-18T00:51:45.8079766Z    Compiling zeroize v1.8.2
2026-08-18T00:51:45.9629777Z    Compiling zerofrom-derive v0.1.7
2026-08-18T00:51:46.0464355Z    Compiling yoke-derive v0.8.2
2026-08-18T00:51:46.3485280Z    Compiling tokio-macros v2.7.0
2026-08-18T00:51:46.8779415Z    Compiling futures-io v0.3.32
2026-08-18T00:51:46.8955800Z    Compiling slab v0.4.12
2026-08-18T00:51:46.9724492Z    Compiling zerofrom v0.1.8
2026-08-18T00:51:47.0032895Z    Compiling futures-sink v0.3.32
2026-08-18T00:51:47.0154238Z    Compiling tokio v1.52.3
2026-08-18T00:51:47.0903423Z    Compiling futures-channel v0.3.32
2026-08-18T00:51:47.2214115Z    Compiling yoke v0.8.3
2026-08-18T00:51:47.2912849Z    Compiling futures-macro v0.3.32
2026-08-18T00:51:47.5985076Z    Compiling rustversion v1.0.22
2026-08-18T00:51:47.8721044Z    Compiling hashbrown v0.17.1
2026-08-18T00:51:47.8759551Z    Compiling rand_core v0.10.1
2026-08-18T00:51:48.1000936Z    Compiling futures-task v0.3.32
2026-08-18T00:51:48.2929311Z    Compiling futures-util v0.3.32
2026-08-18T00:51:48.4812608Z    Compiling once_cell v1.21.4
2026-08-18T00:51:48.5115263Z    Compiling indexmap v2.14.0
2026-08-18T00:51:48.7328131Z    Compiling zerovec-derive v0.11.3
2026-08-18T00:51:49.1064044Z    Compiling getrandom v0.2.17
2026-08-18T00:51:49.2742145Z    Compiling cpufeatures v0.2.17
2026-08-18T00:51:49.5772142Z    Compiling zerovec v0.11.6
2026-08-18T00:51:49.8736199Z    Compiling displaydoc v0.2.6
2026-08-18T00:51:50.3010798Z    Compiling hybrid-array v0.4.12
2026-08-18T00:51:50.4670057Z    Compiling fnv v1.0.7
2026-08-18T00:51:50.5509424Z    Compiling getrandom v0.4.2
2026-08-18T00:51:50.7991848Z    Compiling libc v0.2.186
2026-08-18T00:51:51.0352742Z    Compiling cfg_aliases v0.2.1
2026-08-18T00:51:51.1483515Z    Compiling strsim v0.11.1
2026-08-18T00:51:51.3966710Z    Compiling crypto-common v0.2.2
2026-08-18T00:51:51.6036184Z    Compiling block-buffer v0.12.0
2026-08-18T00:51:51.7518805Z    Compiling tinystr v0.8.3
2026-08-18T00:51:51.7569753Z    Compiling tracing-core v0.1.36
2026-08-18T00:51:52.0691835Z    Compiling tracing-attributes v0.1.31
2026-08-18T00:51:52.4556568Z    Compiling litemap v0.8.2
2026-08-18T00:51:52.4816717Z    Compiling autocfg v1.5.1
2026-08-18T00:51:52.6196917Z    Compiling writeable v0.6.3
2026-08-18T00:51:52.8470155Z    Compiling icu_locale_core v2.2.0
2026-08-18T00:51:52.8706054Z    Compiling zerotrie v0.2.4
2026-08-18T00:51:53.0966774Z    Compiling tracing v0.1.44
2026-08-18T00:51:53.2328636Z    Compiling potential_utf v0.1.5
2026-08-18T00:51:53.3933240Z    Compiling cmake v0.1.58
2026-08-18T00:51:53.5023074Z    Compiling dunce v1.0.5
2026-08-18T00:51:53.6283283Z    Compiling fs_extra v1.3.0
2026-08-18T00:51:53.7680727Z    Compiling icu_properties_data v2.2.0
2026-08-18T00:51:53.8925781Z    Compiling utf8_iter v1.0.4
2026-08-18T00:51:53.9387633Z    Compiling icu_normalizer_data v2.2.0
2026-08-18T00:51:54.0452733Z    Compiling ident_case v1.0.1
2026-08-18T00:51:54.1770363Z    Compiling icu_collections v2.2.0
2026-08-18T00:51:54.5505043Z    Compiling icu_provider v2.2.0
2026-08-18T00:51:54.7524167Z    Compiling aws-lc-sys v0.41.0
2026-08-18T00:51:54.8736783Z    Compiling tokio-util v0.7.18
2026-08-18T00:51:55.0962262Z    Compiling percent-encoding v2.3.2
2026-08-18T00:51:55.2682622Z    Compiling icu_normalizer v2.2.0
2026-08-18T00:51:55.8725059Z    Compiling inout v0.2.2
2026-08-18T00:51:56.0066969Z    Compiling http v1.4.1
2026-08-18T00:51:56.3330122Z    Compiling ring v0.17.14
2026-08-18T00:51:56.6255610Z    Compiling icu_properties v2.2.0
2026-08-18T00:51:56.8594924Z    Compiling thiserror v2.0.18
2026-08-18T00:51:57.1477239Z    Compiling cpufeatures v0.3.0
2026-08-18T00:51:57.2337779Z    Compiling unicode-segmentation v1.13.3
2026-08-18T00:51:57.2583728Z    Compiling aws-lc-rs v1.17.0
2026-08-18T00:51:57.6294797Z    Compiling idna_adapter v1.2.2
2026-08-18T00:51:57.7348951Z    Compiling cipher v0.5.2
2026-08-18T00:51:57.9226081Z    Compiling curve25519-dalek-derive v0.1.1
2026-08-18T00:51:58.0615884Z    Compiling thiserror-impl v2.0.18
2026-08-18T00:51:58.3742719Z    Compiling scopeguard v1.2.0
2026-08-18T00:51:58.4431893Z    Compiling lock_api v0.4.14
2026-08-18T00:51:58.6432416Z    Compiling chacha20 v0.10.0
2026-08-18T00:51:58.9216681Z    Compiling idna v1.1.0
2026-08-18T00:51:59.3034506Z    Compiling form_urlencoded v1.2.2
2026-08-18T00:51:59.4486549Z    Compiling ipnet v2.12.0
2026-08-18T00:51:59.7769625Z    Compiling rustls-pki-types v1.14.1
2026-08-18T00:51:59.9009827Z    Compiling block-buffer v0.10.4
2026-08-18T00:52:00.0225987Z    Compiling untrusted v0.9.0
2026-08-18T00:52:00.0379848Z    Compiling bitflags v2.12.1
2026-08-18T00:52:00.1364586Z    Compiling winapi v0.3.9
2026-08-18T00:52:00.3601825Z    Compiling digest v0.10.7
2026-08-18T00:52:00.6004667Z    Compiling url v2.5.8
2026-08-18T00:52:00.6025591Z    Compiling rand v0.10.1
2026-08-18T00:52:01.3793416Z    Compiling darling_core v0.20.11
2026-08-18T00:52:01.5257514Z    Compiling num-traits v0.2.19
2026-08-18T00:52:01.7103186Z    Compiling windows-result v0.4.1
2026-08-18T00:52:02.0136883Z    Compiling windows-strings v0.5.1
2026-08-18T00:52:02.4232995Z    Compiling rustls v0.23.40
2026-08-18T00:52:02.5927498Z    Compiling heck v0.5.0
2026-08-18T00:52:03.1469265Z    Compiling convert_case v0.10.0
2026-08-18T00:52:03.4486584Z    Compiling const-oid v0.10.2
2026-08-18T00:52:03.6895721Z    Compiling anyhow v1.0.102
2026-08-18T00:52:03.9323416Z    Compiling darling_macro v0.20.11
2026-08-18T00:52:03.9503011Z    Compiling unicode-xid v0.2.6
2026-08-18T00:52:04.0627698Z    Compiling atomic-waker v1.1.2
2026-08-18T00:52:04.1653740Z    Compiling derive_more-impl v2.1.1
2026-08-18T00:52:04.2979375Z    Compiling darling v0.20.11
2026-08-18T00:52:04.9013177Z    Compiling httparse v1.10.1
2026-08-18T00:52:05.2489806Z    Compiling parking_lot_core v0.9.12
2026-08-18T00:52:05.3955107Z    Compiling zerocopy v0.8.50
2026-08-18T00:52:06.1825522Z    Compiling derive_builder_core v0.20.2
2026-08-18T00:52:06.6520818Z    Compiling h2 v0.4.14
2026-08-18T00:52:07.1515913Z    Compiling http-body v1.0.1
2026-08-18T00:52:07.2205149Z    Compiling derive_more v2.1.1
2026-08-18T00:52:07.3198968Z    Compiling curve25519-dalek v4.1.3
2026-08-18T00:52:07.6028181Z    Compiling ahash v0.8.12
2026-08-18T00:52:07.6160417Z    Compiling either v1.16.0
2026-08-18T00:52:07.7984900Z    Compiling base64ct v1.8.3
2026-08-18T00:52:07.8380840Z    Compiling powerfmt v0.2.0
2026-08-18T00:52:08.0871806Z    Compiling pem-rfc7468 v1.0.0
2026-08-18T00:52:08.1241763Z    Compiling deranged v0.5.8
2026-08-18T00:52:08.7133270Z    Compiling derive_builder_macro v0.20.2
2026-08-18T00:52:09.7777761Z    Compiling uuid v1.23.2
2026-08-18T00:52:10.2659074Z    Compiling rand_core v0.6.4
2026-08-18T00:52:10.5134579Z    Compiling windows-interface v0.59.3
2026-08-18T00:52:11.0554119Z    Compiling windows-implement v0.60.2
2026-08-18T00:52:11.6862604Z    Compiling spez v0.1.2
2026-08-18T00:52:11.7745288Z    Compiling n0-error-macros v0.1.3
2026-08-18T00:52:11.7761399Z    Compiling tower-service v0.3.3
2026-08-18T00:52:12.2035982Z    Compiling tinyvec_macros v0.1.1
2026-08-18T00:52:12.2722306Z    Compiling try-lock v0.2.5
2026-08-18T00:52:12.3272337Z    Compiling num-conv v0.2.2
2026-08-18T00:52:12.3577604Z    Compiling time-core v0.1.8
2026-08-18T00:52:12.4612074Z    Compiling pkg-config v0.3.33
2026-08-18T00:52:12.5276682Z    Compiling data-encoding v2.11.0
2026-08-18T00:52:12.5359904Z    Compiling zmij v1.0.21
2026-08-18T00:52:12.7725992Z    Compiling base64 v0.22.1
2026-08-18T00:52:12.9945817Z    Compiling fastrand v2.4.1
2026-08-18T00:52:13.2153370Z    Compiling vcpkg v0.2.15
2026-08-18T00:52:13.3467124Z    Compiling n0-error v0.1.3
2026-08-18T00:52:13.4987014Z    Compiling want v0.3.1
2026-08-18T00:52:13.6207203Z    Compiling tinyvec v1.11.0
2026-08-18T00:52:13.8400964Z    Compiling libsqlite3-sys v0.30.1
2026-08-18T00:52:13.8682917Z    Compiling windows-core v0.62.2
2026-08-18T00:52:14.2309020Z    Compiling parking_lot v0.12.5
2026-08-18T00:52:14.7809459Z    Compiling derive_builder v0.20.2
2026-08-18T00:52:14.8012784Z    Compiling der v0.8.0-rc.10
2026-08-18T00:52:14.9886193Z    Compiling sha2 v0.10.9
2026-08-18T00:52:15.3905806Z    Compiling n0-future v0.3.2
2026-08-18T00:52:15.6046871Z    Compiling vergen-lib v9.1.0
2026-08-18T00:52:15.7951667Z    Compiling pin-project-internal v1.1.13
2026-08-18T00:52:15.8225626Z    Compiling inout v0.1.4
2026-08-18T00:52:15.9599650Z    Compiling diatomic-waker v0.2.3
2026-08-18T00:52:16.1097381Z    Compiling spt-procident v0.55.0 (C:\actions-runner\_work\spt-bs-core\spt-bs-core\crates\spt-procident)
2026-08-18T00:52:16.3661516Z    Compiling winnow v1.0.3
2026-08-18T00:52:16.5638684Z    Compiling crossbeam-utils v0.8.21
2026-08-18T00:52:17.1286233Z    Compiling httpdate v1.0.3
2026-08-18T00:52:17.1376089Z    Compiling spin v0.10.0
2026-08-18T00:52:17.2458958Z    Compiling windows_x86_64_msvc v0.52.6
2026-08-18T00:52:17.3446152Z    Compiling parking v2.2.1
2026-08-18T00:52:17.4401391Z    Compiling signature v2.2.0
2026-08-18T00:52:17.4749497Z    Compiling cordyceps v0.3.4
2026-08-18T00:52:17.4863268Z    Compiling serde_json v1.0.150
2026-08-18T00:52:17.5913618Z    Compiling ed25519 v2.2.3
2026-08-18T00:52:17.7407646Z    Compiling futures-buffered v0.2.13
2026-08-18T00:52:17.7459154Z    Compiling futures-lite v2.6.1
2026-08-18T00:52:17.7744652Z    Compiling toml_parser v1.1.2+spec-1.1.0
2026-08-18T00:52:18.1208156Z    Compiling hyper v1.10.1
2026-08-18T00:52:18.3113347Z    Compiling pin-project v1.1.13
2026-08-18T00:52:18.4058356Z    Compiling spt-poolguard v0.55.0 (C:\actions-runner\_work\spt-bs-core\spt-bs-core\crates\spt-poolguard)
2026-08-18T00:52:18.4962931Z    Compiling spki v0.8.0-rc.4
2026-08-18T00:52:18.6979221Z    Compiling cipher v0.4.4
2026-08-18T00:52:19.1548283Z    Compiling hashbrown v0.14.5
2026-08-18T00:52:19.9146507Z    Compiling digest v0.11.3
2026-08-18T00:52:20.1374999Z    Compiling noq-udp v0.10.0
2026-08-18T00:52:20.2697555Z    Compiling vergen v9.1.0
2026-08-18T00:52:20.4630332Z    Compiling vergen-lib v0.1.6
2026-08-18T00:52:20.4819151Z    Compiling universal-hash v0.5.1
2026-08-18T00:52:20.5904015Z    Compiling curve25519-dalek v5.0.0-pre.6
2026-08-18T00:52:20.6408210Z    Compiling heapless v0.7.17
2026-08-18T00:52:20.6416398Z    Compiling sync_wrapper v1.0.2
2026-08-18T00:52:20.7570699Z    Compiling aho-corasick v1.1.4
2026-08-18T00:52:20.8116359Z    Compiling opaque-debug v0.3.1
2026-08-18T00:52:20.8832458Z    Compiling toml_datetime v1.1.1+spec-1.1.0
2026-08-18T00:52:20.8940066Z    Compiling regex-syntax v0.8.10
2026-08-18T00:52:21.1150486Z    Compiling allocator-api2 v0.2.21
2026-08-18T00:52:21.4970576Z    Compiling byteorder v1.5.0
2026-08-18T00:52:21.6583588Z    Compiling hash32 v0.2.1
2026-08-18T00:52:21.8513577Z    Compiling toml_edit v0.25.12+spec-1.1.0
2026-08-18T00:52:22.9993089Z    Compiling regex-automata v0.4.14
2026-08-18T00:52:23.3464896Z    Compiling polyval v0.6.2
2026-08-18T00:52:24.0077441Z    Compiling hashlink v0.9.1
2026-08-18T00:52:24.2444726Z    Compiling hyper-util v0.1.20
2026-08-18T00:52:25.2723437Z    Compiling spt-store v0.55.0 (C:\actions-runner\_work\spt-bs-core\spt-bs-core\crates\spt-store)
2026-08-18T00:52:26.0171031Z    Compiling pkcs8 v0.11.0-rc.10
2026-08-18T00:52:26.2672570Z    Compiling ed25519-dalek v2.2.0
2026-08-18T00:52:26.5622569Z    Compiling prefix-trie v0.8.4
2026-08-18T00:52:26.6508322Z    Compiling spin v0.9.8
2026-08-18T00:52:26.8702550Z    Compiling futures-executor v0.3.32
2026-08-18T00:52:27.0870255Z    Compiling vergen-gitcl v1.0.8
2026-08-18T00:52:27.1820361Z    Compiling windows-threading v0.2.1
2026-08-18T00:52:27.1830207Z    Compiling fallible-iterator v0.3.0
2026-08-18T00:52:27.3246339Z    Compiling tower-layer v0.3.3
2026-08-18T00:52:27.4474860Z    Compiling fallible-streaming-iterator v0.1.9
2026-08-18T00:52:27.4900942Z    Compiling signature v3.0.0
2026-08-18T00:52:27.6074695Z    Compiling ryu v1.0.23
2026-08-18T00:52:27.6575141Z    Compiling ed25519 v3.0.0-rc.4
2026-08-18T00:52:27.8717016Z    Compiling data-encoding-macro-internal v0.1.18
2026-08-18T00:52:27.8991472Z    Compiling rusqlite v0.32.1
2026-08-18T00:52:28.1009778Z    Compiling windows-future v0.3.2
2026-08-18T00:52:28.4164918Z    Compiling hickory-proto v0.26.0-beta.4
2026-08-18T00:52:28.6968295Z    Compiling futures v0.3.32
2026-08-18T00:52:29.2152427Z    Compiling spt-proto v0.55.0 (C:\actions-runner\_work\spt-bs-core\spt-bs-core\crates\spt-proto)
2026-08-18T00:52:29.3318894Z    Compiling windows-targets v0.52.6
2026-08-18T00:52:29.5625461Z    Compiling regex v1.12.3
2026-08-18T00:52:30.7854831Z    Compiling ghash v0.5.1
2026-08-18T00:52:30.8990039Z    Compiling proc-macro-crate v3.5.0
2026-08-18T00:52:31.3885745Z    Compiling sha2 v0.11.0-rc.5
2026-08-18T00:52:32.0899216Z    Compiling aes v0.8.4
2026-08-18T00:52:32.2510117Z    Compiling ctr v0.9.2
2026-08-18T00:52:32.4098946Z    Compiling windows-collections v0.3.2
2026-08-18T00:52:32.4421837Z    Compiling windows-numerics v0.3.1
2026-08-18T00:52:32.6264955Z    Compiling time v0.3.47
2026-08-18T00:52:32.6500108Z    Compiling http-body-util v0.1.3
2026-08-18T00:52:32.8041239Z    Compiling fs2 v0.4.3
2026-08-18T00:52:32.9651736Z    Compiling cobs v0.3.0
2026-08-18T00:52:32.9783429Z    Compiling postcard-derive v0.2.2
2026-08-18T00:52:33.1147486Z    Compiling aead v0.5.2
2026-08-18T00:52:33.2542042Z    Compiling utf8parse v0.2.2
2026-08-18T00:52:33.7711783Z    Compiling ipconfig v0.3.4
2026-08-18T00:52:33.8307096Z    Compiling arrayvec v0.7.6
2026-08-18T00:52:33.9650199Z    Compiling widestring v1.2.1
2026-08-18T00:52:34.1017238Z    Compiling postcard v1.1.3
2026-08-18T00:52:34.5919922Z    Compiling aes-gcm v0.10.3
2026-08-18T00:52:35.0330428Z    Compiling windows v0.62.2
2026-08-18T00:52:35.2283545Z    Compiling ed25519-dalek v3.0.0-pre.6
2026-08-18T00:52:35.6995837Z    Compiling num_enum_derive v0.7.6
2026-08-18T00:52:36.5042712Z    Compiling windows-sys v0.59.0
2026-08-18T00:52:38.0117381Z    Compiling data-encoding-macro v0.1.20
2026-08-18T00:52:38.1328428Z    Compiling tower v0.5.3
2026-08-18T00:52:38.8796194Z    Compiling crossbeam-epoch v0.9.18
2026-08-18T00:52:39.2445235Z    Compiling crossbeam-channel v0.5.15
2026-08-18T00:52:39.7765331Z    Compiling chrono v0.4.45
2026-08-18T00:52:41.2021694Z    Compiling strum_macros v0.28.0
2026-08-18T00:52:42.8756195Z    Compiling iroh-metrics-derive v0.4.1
2026-08-18T00:52:43.2449301Z    Compiling windows-registry v0.6.1
2026-08-18T00:52:43.6326274Z    Compiling memoffset v0.6.5
2026-08-18T00:52:43.8413792Z    Compiling noq v0.18.0
2026-08-18T00:52:44.0724882Z    Compiling netwatch v0.16.0
2026-08-18T00:52:44.3053357Z    Compiling async-trait v0.1.89
2026-08-18T00:52:45.0053887Z    Compiling enum-assoc v1.3.0
2026-08-18T00:52:45.3207584Z    Compiling acto v0.8.2
2026-08-18T00:52:45.5741330Z    Compiling blake3 v1.8.5
2026-08-18T00:52:45.6808536Z    Compiling identity-hash v0.1.0
2026-08-18T00:52:45.8155904Z    Compiling thiserror v1.0.69
2026-08-18T00:52:45.9853492Z    Compiling foldhash v0.2.0
2026-08-18T00:52:46.0786999Z    Compiling xml-rs v0.8.28
2026-08-18T00:52:46.1712914Z    Compiling sorted-index-buffer v0.2.1
2026-08-18T00:52:46.3172305Z    Compiling mac-addr v0.3.0
2026-08-18T00:52:46.5729180Z    Compiling ref-cast v1.0.25
2026-08-18T00:52:46.8564256Z    Compiling rustc-hash v2.1.2
2026-08-18T00:52:46.9715631Z    Compiling tagptr v0.2.0
2026-08-18T00:52:47.1631551Z    Compiling lru-slab v0.1.2
2026-08-18T00:52:47.2791525Z    Compiling moka v0.12.15
2026-08-18T00:52:47.8265530Z    Compiling xmltree v0.10.3
2026-08-18T00:52:48.0365367Z    Compiling netdev v0.42.0
2026-08-18T00:52:48.4104556Z    Compiling hashbrown v0.16.1
2026-08-18T00:52:49.3243888Z    Compiling iroh-metrics v0.38.3
2026-08-18T00:52:49.5665470Z    Compiling strum v0.28.0
2026-08-18T00:52:49.6200782Z    Compiling wmi v0.18.4
2026-08-18T00:52:49.8361168Z    Compiling tower-http v0.6.11
2026-08-18T00:52:50.3784343Z    Compiling spt-msg v0.55.0 (C:\actions-runner\_work\spt-bs-core\spt-bs-core\crates\spt-msg)
2026-08-18T00:52:50.4252669Z    Compiling iroh-base v0.98.0
2026-08-18T00:52:50.9972080Z    Compiling num_enum v0.7.6
2026-08-18T00:52:51.2467450Z    Compiling iroh-relay v0.98.0
2026-08-18T00:52:51.2675371Z    Compiling n0-watcher v0.6.1
2026-08-18T00:52:51.2895289Z    Compiling attohttpc v0.30.1
2026-08-18T00:52:51.7579195Z    Compiling simple-dns v0.9.3
2026-08-18T00:52:52.0296813Z    Compiling tokio-stream v0.1.18
2026-08-18T00:52:52.7478611Z    Compiling serial-core v0.4.0
2026-08-18T00:52:52.8133683Z    Compiling serde_spanned v0.6.9
2026-08-18T00:52:52.9150542Z    Compiling toml_datetime v0.6.11
2026-08-18T00:52:52.9499139Z    Compiling thiserror-impl v1.0.69
2026-08-18T00:52:53.1599036Z    Compiling ref-cast-impl v1.0.25
2026-08-18T00:52:53.5497174Z    Compiling serde_derive_internals v0.29.1
2026-08-18T00:52:54.0483298Z    Compiling arrayref v0.3.9
2026-08-18T00:52:54.1054815Z    Compiling constant_time_eq v0.4.2
2026-08-18T00:52:54.2766993Z    Compiling sha1_smol v1.0.1
2026-08-18T00:52:54.2917620Z    Compiling smol_str v0.1.24
2026-08-18T00:52:54.4550104Z    Compiling toml_write v0.1.2
2026-08-18T00:52:54.4551268Z    Compiling winreg v0.10.1
2026-08-18T00:52:54.4780901Z    Compiling winnow v0.7.15
2026-08-18T00:52:54.6804134Z    Compiling simdutf8 v0.1.5
2026-08-18T00:52:54.6858512Z    Compiling resolv-conf v0.7.6
2026-08-18T00:52:55.0922820Z    Compiling schemars_derive v1.2.1
2026-08-18T00:52:56.2833793Z    Compiling toml_edit v0.22.27
2026-08-18T00:52:56.7327796Z    Compiling iroh-dns v0.98.0
2026-08-18T00:52:56.7954577Z    Compiling serial-windows v0.4.0
2026-08-18T00:52:57.1244632Z    Compiling igd-next v0.17.1
2026-08-18T00:52:59.3458066Z    Compiling lru v0.16.4
2026-08-18T00:52:59.4969905Z    Compiling hmac v0.12.1
2026-08-18T00:52:59.6165398Z    Compiling webpki-roots v1.0.7
2026-08-18T00:52:59.7394442Z    Compiling darling_core v0.23.0
2026-08-18T00:53:00.4920224Z    Compiling seize v0.5.1
2026-08-18T00:53:00.9727767Z    Compiling iroh v0.98.2
2026-08-18T00:53:01.1902674Z    Compiling serde_bytes v0.11.19
2026-08-18T00:53:01.4221175Z    Compiling dyn-clone v1.0.20
2026-08-18T00:53:01.5106822Z    Compiling pin-utils v0.1.0
2026-08-18T00:53:01.5625211Z    Compiling anstyle v1.0.14
2026-08-18T00:53:01.6172735Z    Compiling cmov v0.5.4
2026-08-18T00:53:02.0107467Z    Compiling lazy_static v1.5.0
2026-08-18T00:53:02.0481388Z    Compiling once_cell_polyfill v1.70.2
2026-08-18T00:53:02.1079288Z    Compiling bitflags v1.3.2
2026-08-18T00:53:02.1296489Z    Compiling anstyle-wincon v3.0.11
2026-08-18T00:53:02.1703370Z    Compiling nix v0.25.1
2026-08-18T00:53:02.2352013Z    Compiling shared_library v0.1.9
2026-08-18T00:53:02.3785371Z    Compiling ctutils v0.4.2
2026-08-18T00:53:02.4489131Z    Compiling schemars v1.2.1
2026-08-18T00:53:02.6063647Z    Compiling darling_macro v0.23.0
2026-08-18T00:53:02.7051927Z    Compiling papaya v0.2.4
2026-08-18T00:53:02.9229779Z    Compiling hkdf v0.12.4
2026-08-18T00:53:03.0447355Z    Compiling toml v0.8.23
2026-08-18T00:53:03.0749645Z    Compiling portmapper v0.16.0
2026-08-18T00:53:03.8871160Z    Compiling serial v0.4.0
2026-08-18T00:53:03.9626620Z    Compiling filedescriptor v0.8.3
2026-08-18T00:53:04.1528230Z    Compiling swarm-discovery v0.6.0-alpha.2 (https://github.com/SaberMage/swarm-discovery?rev=89a2200d54a4e3cab2f46cc75ebff49a1fb07614#89a2200d)
2026-08-18T00:53:04.9365639Z    Compiling anstyle-parse v1.0.0
2026-08-18T00:53:05.0948423Z    Compiling backon v1.6.0
2026-08-18T00:53:05.3861065Z    Compiling anstyle-query v1.1.5
2026-08-18T00:53:05.5214216Z    Compiling vte_generate_state_changes v0.1.2
2026-08-18T00:53:05.7674658Z    Compiling colorchoice v1.0.5
2026-08-18T00:53:05.8595265Z    Compiling instability v0.3.12
2026-08-18T00:53:06.0631766Z    Compiling is_terminal_polyfill v1.70.2
2026-08-18T00:53:06.1314580Z    Compiling shell-words v1.1.1
2026-08-18T00:53:06.2978926Z    Compiling foldhash v0.1.5
2026-08-18T00:53:06.4679733Z    Compiling downcast-rs v1.2.1
2026-08-18T00:53:06.5936742Z    Compiling paste v1.0.15
2026-08-18T00:53:06.8762702Z    Compiling unicode-width v0.2.0
2026-08-18T00:53:07.1748669Z    Compiling portable-pty v0.8.1
2026-08-18T00:53:07.3208503Z    Compiling hashbrown v0.15.5
2026-08-18T00:53:07.9055974Z    Compiling anstream v1.0.0
2026-08-18T00:53:08.2160013Z    Compiling vte v0.13.1
2026-08-18T00:53:08.2837056Z    Compiling spt-runtime v0.55.0 (C:\actions-runner\_work\spt-bs-core\spt-bs-core\crates\spt-runtime)
2026-08-18T00:53:08.3441398Z    Compiling spake2 v0.4.0
2026-08-18T00:53:08.6316700Z    Compiling darling v0.23.0
2026-08-18T00:53:08.8105134Z    Compiling itertools v0.13.0
2026-08-18T00:53:08.8238502Z    Compiling crossterm_winapi v0.9.1
2026-08-18T00:53:09.1766391Z    Compiling strum_macros v0.26.4
2026-08-18T00:53:10.1458005Z    Compiling sha1 v0.10.6
2026-08-18T00:53:10.3398838Z    Compiling castaway v0.2.4
2026-08-18T00:53:10.4467703Z    Compiling terminal_size v0.4.4
2026-08-18T00:53:10.5867089Z    Compiling doctest-file v1.1.1
2026-08-18T00:53:10.6259576Z    Compiling static_assertions v1.1.0
2026-08-18T00:53:10.7654185Z    Compiling indoc v2.0.7
2026-08-18T00:53:10.9328599Z    Compiling unicode-width v0.1.14
2026-08-18T00:53:11.0888675Z    Compiling clap_lex v1.1.0
2026-08-18T00:53:11.4477277Z    Compiling recvmsg v1.0.0
2026-08-18T00:53:11.5170711Z    Compiling clap_builder v4.6.0
2026-08-18T00:53:11.8939673Z    Compiling interprocess v2.4.2
2026-08-18T00:53:13.3585883Z    Compiling unicode-truncate v1.1.0
2026-08-18T00:53:14.0204027Z    Compiling compact_str v0.8.2
2026-08-18T00:53:14.6967024Z    Compiling strum v0.26.3
2026-08-18T00:53:14.9539194Z    Compiling spt-live v0.55.0 (C:\actions-runner\_work\spt-bs-core\spt-bs-core\crates\spt-live)
2026-08-18T00:53:15.8812840Z    Compiling crossterm v0.28.1
2026-08-18T00:53:16.0612169Z    Compiling spt-term v0.55.0 (C:\actions-runner\_work\spt-bs-core\spt-bs-core\crates\spt-term)
2026-08-18T00:53:16.3207104Z    Compiling lru v0.12.5
2026-08-18T00:53:17.0582200Z    Compiling clap_derive v4.6.1
2026-08-18T00:53:17.2035690Z    Compiling error-code v3.3.2
2026-08-18T00:53:17.3658713Z    Compiling cassowary v0.3.0
2026-08-18T00:53:17.9511569Z    Compiling ratatui v0.29.0
2026-08-18T00:53:18.5094952Z    Compiling clipboard-win v5.4.1
2026-08-18T00:53:18.5805571Z    Compiling clap v4.6.1
2026-08-18T00:53:18.7676666Z    Compiling nucleo-matcher v0.3.1
2026-08-18T00:53:18.8833680Z    Compiling qrcode v0.14.1
2026-08-18T00:53:27.3753271Z    Compiling rustls-webpki v0.103.13
2026-08-18T00:53:30.7523339Z    Compiling tokio-rustls v0.26.4
2026-08-18T00:53:30.7523751Z    Compiling rustls-platform-verifier v0.7.0
2026-08-18T00:53:30.7524154Z    Compiling noq-proto v0.17.0
2026-08-18T00:53:31.0115537Z    Compiling hickory-net v0.26.0-beta.4
2026-08-18T00:53:31.0639448Z    Compiling hyper-rustls v0.27.9
2026-08-18T00:53:31.3527768Z    Compiling reqwest v0.13.4
2026-08-18T00:53:33.2545213Z    Compiling hickory-resolver v0.26.0-beta.4
2026-08-18T00:53:36.7170186Z    Compiling tokio-websockets v0.13.2
2026-08-18T00:53:56.2113488Z    Compiling spt-net v0.55.0 (C:\actions-runner\_work\spt-bs-core\spt-bs-core\crates\spt-net)
2026-08-18T00:53:58.3340542Z    Compiling spt-daemon v0.55.0 (C:\actions-runner\_work\spt-bs-core\spt-bs-core\crates\spt-daemon)
2026-08-18T00:54:15.0026408Z    Compiling spt v0.55.0 (C:\actions-runner\_work\spt-bs-core\spt-bs-core\crates\spt)
2026-08-18T00:54:15.3060223Z     Finished `dev` profile [unoptimized + debuginfo] target(s) in 2m 39s
2026-08-18T00:54:15.4115627Z ##[group]Run cargo nextest run --workspace -E 'kind(lib) + kind(bin)'
2026-08-18T00:54:15.4116231Z [36;1mcargo nextest run --workspace -E 'kind(lib) + kind(bin)'[0m
2026-08-18T00:54:15.4122266Z shell: C:\Program Files\PowerShell\7\pwsh.EXE -command ". '{0}'"
2026-08-18T00:54:15.4122610Z ##[endgroup]
2026-08-18T00:54:17.1054226Z    Compiling fastrand v2.4.1
2026-08-18T00:54:17.1074720Z    Compiling spt-poolguard v0.55.0 (C:\actions-runner\_work\spt-bs-core\spt-bs-core\crates\spt-poolguard)
2026-08-18T00:54:17.1637059Z    Compiling bytemuck v1.25.2
2026-08-18T00:54:17.1637549Z    Compiling mock-adapter v0.55.0 (C:\actions-runner\_work\spt-bs-core\spt-bs-core\adapters\mock)
2026-08-18T00:54:17.2787266Z    Compiling tempfile v3.27.0
2026-08-18T00:54:17.4200561Z    Compiling futures-lite v2.6.1
2026-08-18T00:54:17.7851391Z    Compiling backon v1.6.0
2026-08-18T00:54:17.9473371Z    Compiling n0-future v0.3.2
2026-08-18T00:54:17.9773479Z    Compiling spt-store v0.55.0 (C:\actions-runner\_work\spt-bs-core\spt-bs-core\crates\spt-store)
2026-08-18T00:54:17.9785419Z    Compiling spt-test-support v0.55.0 (C:\actions-runner\_work\spt-bs-core\spt-bs-core\crates\spt-test-support)
2026-08-18T00:54:18.5836472Z    Compiling n0-watcher v0.6.1
2026-08-18T00:54:18.7178761Z    Compiling iroh-dns v0.98.0
2026-08-18T00:54:18.7560652Z    Compiling rgb v0.8.53
2026-08-18T00:54:18.8243320Z    Compiling netwatch v0.16.0
2026-08-18T00:54:19.0979978Z    Compiling iroh-relay v0.98.0
2026-08-18T00:54:19.1753384Z    Compiling avt v0.18.0
2026-08-18T00:54:20.3313833Z    Compiling portmapper v0.16.0
2026-08-18T00:54:24.6008562Z    Compiling spt-msg v0.55.0 (C:\actions-runner\_work\spt-bs-core\spt-bs-core\crates\spt-msg)
2026-08-18T00:54:25.4082567Z    Compiling spt-term v0.55.0 (C:\actions-runner\_work\spt-bs-core\spt-bs-core\crates\spt-term)
2026-08-18T00:54:27.5309055Z    Compiling spt-runtime v0.55.0 (C:\actions-runner\_work\spt-bs-core\spt-bs-core\crates\spt-runtime)
2026-08-18T00:54:27.6758951Z    Compiling iroh v0.98.2
2026-08-18T00:54:31.6700902Z    Compiling spt-live v0.55.0 (C:\actions-runner\_work\spt-bs-core\spt-bs-core\crates\spt-live)
2026-08-18T00:54:45.3504786Z    Compiling spt-proto v0.55.0 (C:\actions-runner\_work\spt-bs-core\spt-bs-core\crates\spt-proto)
2026-08-18T00:54:45.7415052Z    Compiling spt-procident v0.55.0 (C:\actions-runner\_work\spt-bs-core\spt-bs-core\crates\spt-procident)
2026-08-18T00:54:48.9023735Z    Compiling spt-net v0.55.0 (C:\actions-runner\_work\spt-bs-core\spt-bs-core\crates\spt-net)
2026-08-18T00:54:50.7958494Z    Compiling spt-daemon v0.55.0 (C:\actions-runner\_work\spt-bs-core\spt-bs-core\crates\spt-daemon)
2026-08-18T00:55:12.1714225Z    Compiling spt v0.55.0 (C:\actions-runner\_work\spt-bs-core\spt-bs-core\crates\spt)
2026-08-18T00:56:28.1027584Z    Compiling xtask v0.55.0 (C:\actions-runner\_work\spt-bs-core\spt-bs-core\crates\xtask)
2026-08-18T00:58:01.1405946Z     Finished `test` profile [unoptimized + debuginfo] target(s) in 3m 44s
2026-08-18T00:58:08.0176283Z ────────────
2026-08-18T00:58:08.0177312Z  Nextest run ID 431d952d-723b-40b1-b26f-4af2285067c2 with nextest profile: default
2026-08-18T00:58:08.0177688Z     Starting 2564 tests across 24 binaries (1 test and 167 binaries skipped)
2026-08-18T00:58:08.0565935Z         PASS [   0.029s] (   1/2564) spt::bin/spt api::auth::tests::mints_distinct_nonempty_tokens
2026-08-18T00:58:08.0726726Z         PASS [   0.044s] (   2/2564) spt::bin/spt api::auth::tests::no_proof_is_refused
2026-08-18T00:58:08.0808589Z         PASS [   0.056s] (   3/2564) spt::bin/spt accessview::tests::target_roster_groups_types_and_counts_rules
2026-08-18T00:58:08.0814380Z         PASS [   0.056s] (   4/2564) spt::bin/spt api::auth::tests::live_owner_mismatch_still_refuses
2026-08-18T00:58:08.0896063Z         PASS [   0.064s] (   5/2564) spt::bin/spt api::auth::tests::missing_endpoint_is_no_endpoint
2026-08-18T00:58:08.0970648Z         PASS [   0.072s] (   6/2564) spt::bin/spt api::auth::tests::an_unverifiable_live_owner_never_grants_a_repin
2026-08-18T00:58:08.0989340Z         PASS [   0.074s] (   7/2564) spt::bin/spt api::auth::tests::pinned_to_dead_sid_mismatched_poll_repins
2026-08-18T00:58:08.1043398Z         PASS [   0.079s] (   8/2564) mock-adapter::bin/capture-player tests::refuses_a_length_mismatch
2026-08-18T00:58:08.1052369Z         PASS [   0.080s] (   9/2564) spt::bin/spt api::auth::tests::dead_owner_repin_refused_when_sid_is_a_psyche_custody_sid
2026-08-18T00:58:08.1059879Z         PASS [   0.081s] (  10/2564) spt::bin/spt api::auth::tests::dead_owner_repin_refused_when_sid_owns_another_perch
2026-08-18T00:58:08.1092843Z         PASS [   0.084s] (  11/2564) mock-adapter::bin/capture-player tests::parses_a_well_formed_record
2026-08-18T00:58:08.1186291Z         PASS [   0.094s] (  12/2564) spt::bin/spt accessview::tests::a_pinned_open_renders_apart_from_a_default_open
2026-08-18T00:58:08.1231112Z         PASS [   0.098s] (  13/2564) spt::bin/spt accessview::tests::drill_matches_only_its_own_kind
2026-08-18T00:58:08.1232644Z         PASS [   0.098s] (  14/2564) spt::bin/spt api::auth::tests::dead_owner_repin_still_rescues_a_non_custody_sid
2026-08-18T00:58:08.1329695Z         PASS [   0.107s] (  15/2564) spt::bin/spt accessview::tests::node_roster_lists_node_scope_entities_and_mode_exceptions
2026-08-18T00:58:08.1528801Z         PASS [   0.071s] (  16/2564) spt::bin/spt api::auth::tests::worker_missing_is_no_endpoint
2026-08-18T00:58:08.1739236Z         PASS [   0.117s] (  17/2564) spt::bin/spt api::auth::tests::session_id_proof_authenticates
2026-08-18T00:58:08.1780444Z         PASS [   0.152s] (  18/2564) spt::bin/spt api::auth::tests::a_recycled_owner_pid_no_longer_blocks_the_dead_owner_rescue
2026-08-18T00:58:08.1781118Z         PASS [   0.109s] (  19/2564) spt::bin/spt api::auth::tests::token_auth_path_unchanged
2026-08-18T00:58:08.1781621Z         PASS [   0.097s] (  20/2564) spt::bin/spt api::auth::tests::token_proof_authenticates
2026-08-18T00:58:08.1986337Z         PASS [   0.108s] (  21/2564) spt::bin/spt api::auth::tests::worker_parent_current_sid_authenticates_after_rotation
2026-08-18T00:58:08.2281104Z         PASS [   0.123s] (  22/2564) spt::bin/spt api::auth::tests::worker_stored_sid_authenticates
2026-08-18T00:58:08.2282193Z         PASS [   0.125s] (  23/2564) spt::bin/spt api::auth::tests::worker_wrong_sid_and_token_only_refused
2026-08-18T00:58:08.2306995Z         PASS [   0.122s] (  24/2564) spt::bin/spt api::auth::tests::wrong_token_and_wrong_session_refused
2026-08-18T00:58:08.2307739Z         PASS [   0.122s] (  25/2564) spt::bin/spt api::delivery::tests::echo_gate_explicit_toggle
2026-08-18T00:58:08.2418732Z         PASS [   0.119s] (  26/2564) spt::bin/spt api::delivery::tests::inject_all_pty_falls_back_to_hook
2026-08-18T00:58:08.2522032Z         PASS [   0.147s] (  27/2564) spt::bin/spt api::delivery::tests::an_undated_state_is_dated_by_a_non_edge_report
2026-08-18T00:58:08.2587276Z         PASS [   0.136s] (  28/2564) spt::bin/spt api::delivery::tests::idle_no_gate_does_not_arm_gate
2026-08-18T00:58:08.2617137Z         PASS [   0.152s] (  29/2564) spt::bin/spt api::delivery::tests::idle_busy_transitions_manage_sentinels
2026-08-18T00:58:08.2846194Z         PASS [   0.152s] (  30/2564) spt::bin/spt api::delivery::tests::inject_resolution_drops_pty_defaults_hook
2026-08-18T00:58:08.3239514Z         PASS [   0.100s] (  31/2564) spt::bin/spt api::engineroom::tests::a_pin_is_not_a_clear
2026-08-18T00:58:08.3282777Z         PASS [   0.102s] (  32/2564) spt::bin/spt api::engineroom::tests::a_refresh_adopts_only_a_real_divergence
2026-08-18T00:58:08.3326255Z         PASS [   0.105s] (  33/2564) spt::bin/spt api::engineroom::tests::an_admin_code_verifies_across_the_ceremony_window_only
2026-08-18T00:58:08.3362057Z         PASS [   0.094s] (  34/2564) spt::bin/spt api::engineroom::tests::subnet_authority_is_the_empowerment_not_the_gate
2026-08-18T00:58:08.3411985Z         PASS [   0.089s] (  35/2564) spt::bin/spt api::engineroom::tests::the_gate_admits_only_the_reserved_id_provisioned_and_authenticated
2026-08-18T00:58:08.3458969Z         PASS [   0.087s] (  36/2564) spt::bin/spt api::engineroom::tests::the_perch_minting_verbs_admit_the_reserved_id_only_as_a_completion
2026-08-18T00:58:08.3619817Z         PASS [   0.038s] (  37/2564) spt::bin/spt api::engineroom::tests::the_unset_echo_names_what_governs_next
2026-08-18T00:58:08.3663834Z         PASS [   0.038s] (  38/2564) spt::bin/spt api::engineroom::tests::the_written_node_mode_is_the_one_the_chain_reads
2026-08-18T00:58:08.3934866Z         PASS [   0.132s] (  39/2564) spt::bin/spt api::engineroom::tests::the_surface_mode_verb_refuses_a_caller_that_is_not_the_engine_room
2026-08-18T00:58:08.3938009Z         PASS [   0.241s] (  40/2564) spt::bin/spt api::delivery::tests::only_a_real_state_edge_stamps_the_transition_instant
2026-08-18T00:58:08.4213961Z         PASS [   0.059s] (  41/2564) spt::bin/spt api::reporting::tests::boundary_missing_perch_refused
2026-08-18T00:58:08.4226509Z         PASS [   0.138s] (  42/2564) spt::bin/spt api::engineroom::tests::the_surface_mode_verb_refuses_an_unminted_surface_and_writes_nothing
2026-08-18T00:58:08.4420853Z         PASS [   0.019s] (  43/2564) spt::bin/spt api::reporting::tests::capability_lists_hostable_types
2026-08-18T00:58:08.5372778Z         PASS [   0.418s] (  44/2564) spt::bin/spt api::delivery::tests::idle_drain_peek_returns_non_deferred_rows_only
2026-08-18T00:58:08.5664272Z         PASS [   0.173s] (  45/2564) spt::bin/spt api::reporting::tests::boundary_refuses_rotating_onto_a_psyche_custody_sid
2026-08-18T00:58:08.6346143Z         PASS [   0.098s] (  46/2564) spt::bin/spt api::reporting::tests::driven_by_reads_daemon_marker
2026-08-18T00:58:08.6346612Z         PASS [   0.192s] (  47/2564) spt::bin/spt api::reporting::tests::digest_entry_validates_and_appends_to_digest_log
2026-08-18T00:58:08.6663217Z         PASS [   0.488s] (  48/2564) spt::bin/spt api::delivery::tests::poll_drains_non_deferred_by_default
2026-08-18T00:58:08.6695357Z         PASS [   0.035s] (  49/2564) spt::bin/spt api::reporting::tests::endpoint_info_attached_node_self_attributes_own_node_driver
2026-08-18T00:58:08.6857243Z         PASS [   0.051s] (  50/2564) spt::bin/spt api::reporting::tests::endpoint_info_attached_node_from_honest_stamps
2026-08-18T00:58:08.7213976Z         PASS [   0.054s] (  51/2564) spt::bin/spt api::reporting::tests::endpoint_info_json_always_carries_an_activity_word
2026-08-18T00:58:08.7326371Z         PASS [   0.166s] (  52/2564) spt::bin/spt api::reporting::tests::endpoint_info_activity_word_tracks_the_idle_sentinel
2026-08-18T00:58:08.7652174Z         PASS [   0.568s] (  53/2564) spt::bin/spt api::delivery::tests::poll_only_drains_when_hook_method_present
2026-08-18T00:58:08.7670490Z         PASS [   0.434s] (  54/2564) spt::bin/spt api::reporting::tests::a_non_engine_room_boundary_never_moves_the_seats_empowerment
2026-08-18T00:58:08.7737928Z         PASS [   0.437s] (  55/2564) spt::bin/spt api::reporting::tests::a_rotated_away_session_id_cannot_resurrect_a_dropped_empowerment
2026-08-18T00:58:08.7759965Z         PASS [   0.410s] (  56/2564) spt::bin/spt api::reporting::tests::boundary_rebinds_keeping_anchor
2026-08-18T00:58:08.7885509Z         PASS [   0.103s] (  57/2564) spt::bin/spt api::reporting::tests::env_aliases_resolved_from_manifest
2026-08-18T00:58:08.7998019Z         PASS [   0.456s] (  58/2564) spt::bin/spt api::reporting::tests::boundary_appends_to_the_session_ledger
2026-08-18T00:58:08.7998826Z         PASS [   0.378s] (  59/2564) spt::bin/spt api::reporting::tests::boundary_with_a_fresh_sid_is_unaffected_by_the_squat_guard
2026-08-18T00:58:08.8001642Z         PASS [   0.067s] (  60/2564) spt::bin/spt api::reporting::tests::filedrops_are_fixed_named_files
2026-08-18T00:58:08.8002403Z         PASS [   0.626s] (  61/2564) spt::bin/spt api::delivery::tests::poll_drain_holds_deferred_while_resting_and_releases_once_on_wake
2026-08-18T00:58:08.8364147Z         PASS [   0.657s] (  62/2564) spt::bin/spt api::delivery::tests::poll_drain_suppresses_idle_only_which_reaches_the_relay
2026-08-18T00:58:08.8373503Z         PASS [   0.167s] (  63/2564) spt::bin/spt api::reporting::tests::endpoint_info_reports_and_refuses
2026-08-18T00:58:08.9000134Z         PASS [   0.101s] (  64/2564) spt::bin/spt api::reporting::tests::presence_records_endpoint
2026-08-18T00:58:08.9000944Z         PASS [   0.122s] (  65/2564) spt::bin/spt api::reporting::tests::history_log_appends
2026-08-18T00:58:08.9009045Z         PASS [   0.117s] (  66/2564) spt::bin/spt api::reporting::tests::misplaced_drop_is_still_found_once_the_anchor_is_correct
2026-08-18T00:58:08.9016509Z         PASS [   0.129s] (  67/2564) spt::bin/spt api::reporting::tests::hint_once_per_session_one_per_message
2026-08-18T00:58:08.9401106Z         PASS [   0.749s] (  68/2564) spt::bin/spt api::delivery::tests::poll_drain_validates_notify_copies_against_their_rows
2026-08-18T00:58:08.9600497Z         PASS [   0.083s] (  69/2564) spt::bin/spt api::tests::adapter_is_optional
2026-08-18T00:58:08.9678976Z         PASS [   0.132s] (  70/2564) spt::bin/spt api::startup::tests::a_dead_binder_pid_proves_nothing_and_never_drops_the_stamp
2026-08-18T00:58:08.9735142Z         PASS [   0.013s] (  71/2564) spt::bin/spt api::tests::state_value_is_validated
2026-08-18T00:58:08.9844164Z         PASS [   0.016s] (  72/2564) spt::bin/spt api::startup::tests::a_dead_relays_capability_stamp_is_not_resurrected_by_a_listener_rebind
2026-08-18T00:58:08.9851154Z         PASS [   0.091s] (  73/2564) spt::bin/spt api::tests::ctx_manifest_unregistered_no_manifest_is_none_not_fatal
2026-08-18T00:58:09.0167309Z         PASS [   0.796s] (  74/2564) spt::bin/spt api::engineroom::tests::a_non_engine_room_attempt_never_touches_the_empower_ledger
2026-08-18T00:58:09.0184291Z         PASS [   0.129s] (  75/2564) spt::bin/spt api::tests::ctx_manifest_override_wins_when_manifest_present
2026-08-18T00:58:09.0185196Z         PASS [   0.045s] (  76/2564) spt::bin/spt api::tests::surface_parses
2026-08-18T00:58:09.0192098Z         PASS [   0.093s] (  77/2564) spt::bin/spt api::tests::load_manifest_resolves_composite_adapter_option
2026-08-18T00:58:09.0196384Z         PASS [   0.300s] (  78/2564) spt::bin/spt api::reporting::tests::erase_unregisters_regardless_of_liveness
2026-08-18T00:58:09.0558989Z         PASS [   0.165s] (  79/2564) spt::bin/spt api::tests::ctx_manifest_resolves_from_registry_when_manifest_absent
2026-08-18T00:58:09.0729399Z         PASS [   0.273s] (  80/2564) spt::bin/spt api::reporting::tests::session_end_erase_wipes_childless_perch
2026-08-18T00:58:09.0868054Z         PASS [   0.286s] (  81/2564) spt::bin/spt api::reporting::tests::session_end_soft_preserves_state
2026-08-18T00:58:09.0969156Z         PASS [   0.751s] (  82/2564) spt::bin/spt api::reporting::tests::boundary_injects_deferred_shell_context
2026-08-18T00:58:09.1019363Z         PASS [   0.707s] (  83/2564) spt::bin/spt api::reporting::tests::boundary_resurfaces_undismissed_notifs
2026-08-18T00:58:09.1135042Z         PASS [   0.311s] (  84/2564) spt::bin/spt api::reporting::tests::soft_end_preserves_a_live_listeners_address
2026-08-18T00:58:09.1163615Z         PASS [   0.131s] (  85/2564) spt::bin/spt api::worker::tests::cascade_guard_tracks_live_children
2026-08-18T00:58:09.1686748Z         PASS [   0.094s] (  86/2564) spt::bin/spt cli::lifecycle_verb_decisions::remembered_defaults_prefer_the_newest_row_field_by_field
2026-08-18T00:58:09.1689052Z         PASS [   0.371s] (  87/2564) spt::bin/spt api::reporting::tests::session_end_erase_refused_with_live_children
2026-08-18T00:58:09.1703046Z         PASS [   0.382s] (  88/2564) spt::bin/spt api::reporting::tests::session_end_erase_reaps_stale_worker_then_proceeds
2026-08-18T00:58:09.1713775Z         PASS [   0.337s] (  89/2564) spt::bin/spt api::reporting::tests::soft_end_still_cleans_a_dead_listeners_address
2026-08-18T00:58:09.1800164Z         PASS [   0.092s] (  90/2564) spt::bin/spt cli::lifecycle_verb_decisions::the_adapter_precedence_is_flag_then_endpoint_then_a_sole_installed_one
2026-08-18T00:58:09.1801374Z         PASS [   0.083s] (  91/2564) spt::bin/spt cli::lifecycle_verb_decisions::the_go_ladder_takes_the_ratified_rung
2026-08-18T00:58:09.1868431Z         PASS [   0.086s] (  92/2564) spt::bin/spt cli::reserved_id_tests::endpoint_run_refuses_the_reserved_id_and_saves_nothing
2026-08-18T00:58:09.2189395Z         PASS [   0.199s] (  93/2564) spt::bin/spt api::worker::tests::worker_start_nests_under_parent
2026-08-18T00:58:09.2256114Z         PASS [   0.058s] (  94/2564) spt::bin/spt cli::resume_resolution_tests::resume_never_feeds_a_provisional
2026-08-18T00:58:09.2277921Z         PASS [   0.059s] (  95/2564) spt::bin/spt cli::retired_verb_pre_scan::the_pre_scan_reads_the_verb_position_only
2026-08-18T00:58:09.2333512Z         PASS [   0.063s] (  96/2564) spt::bin/spt cli::retired_verb_pre_scan::the_retired_verb_refuses_with_a_pointer_a_generic_error_cannot_fake
2026-08-18T00:58:09.2375149Z         PASS [   0.066s] (  97/2564) spt::bin/spt cli::run_home_tests::order_by_mru_orders_guidance
2026-08-18T00:58:09.2640537Z         PASS [   0.246s] (  98/2564) spt::bin/spt api::worker::tests::guard_clears_only_when_all_children_stopped
2026-08-18T00:58:09.2642848Z         PASS [   0.146s] (  99/2564) spt::bin/spt cli::reserved_id_tests::the_lifecycle_verbs_refuse_their_preconditions
2026-08-18T00:58:09.2699335Z         PASS [   0.086s] ( 100/2564) spt::bin/spt cli::run_on_live_tests::run_on_live_never_duplicates_and_create_conflicts
2026-08-18T00:58:09.2700024Z         PASS [   0.088s] ( 101/2564) spt::bin/spt cli::run_home_tests::run_home_resolution_matrix
2026-08-18T00:58:09.2700679Z         PASS [   0.250s] ( 102/2564) spt::bin/spt api::worker::tests::worker_start_mints_id_stores_parent_sid_and_metadata
2026-08-18T00:58:09.2712340Z         PASS [   0.215s] ( 103/2564) spt::bin/spt api::worker::tests::worker_start_registration_sid_falls_back_to_presented
2026-08-18T00:58:09.2831081Z         PASS [   0.065s] ( 104/2564) spt::bin/spt cli::tests::a_mint_captures_its_declared_mode_and_nothing_else
2026-08-18T00:58:09.2951418Z         PASS [   0.062s] ( 105/2564) spt::bin/spt cli::tests::a_notfound_lands_locally_only_when_the_target_is_an_endpoint_here
2026-08-18T00:58:09.3073421Z         PASS [   0.069s] ( 106/2564) spt::bin/spt cli::tests::a_one_way_approval_hands_over_a_reverse_command_that_parses
2026-08-18T00:58:09.3201549Z         PASS [   0.058s] ( 107/2564) spt::bin/spt cli::tests::a_remote_send_receive_claims_only_what_it_can_deliver
2026-08-18T00:58:09.3243359Z         PASS [   0.057s] ( 108/2564) spt::bin/spt cli::tests::a_reply_carried_request_is_not_stamped_as_a_first_order_knock
2026-08-18T00:58:09.3296569Z         PASS [   0.063s] ( 109/2564) spt::bin/spt cli::tests::a_retired_flag_names_what_replaced_it
2026-08-18T00:58:09.3335535Z         PASS [   0.064s] ( 110/2564) spt::bin/spt cli::tests::a_row_without_a_node_says_so_and_one_with_a_node_shows_it
2026-08-18T00:58:09.3385219Z         PASS [   0.067s] ( 111/2564) spt::bin/spt cli::tests::a_rule_describes_itself_in_plain_words
2026-08-18T00:58:09.3402737Z         PASS [   0.113s] ( 112/2564) spt::bin/spt cli::tests::a_non_attributable_bake_needs_the_acknowledgment_and_keeps_it
2026-08-18T00:58:09.3476382Z         PASS [   0.122s] ( 113/2564) spt::bin/spt cli::tests::a_minted_sealed_code_is_the_one_that_opens_to_its_record
2026-08-18T00:58:09.3706843Z         PASS [   0.184s] ( 114/2564) spt::bin/spt cli::tests::a_local_hit_never_asks_the_broker
2026-08-18T00:58:09.3863843Z         PASS [   0.103s] ( 115/2564) spt::bin/spt cli::tests::a_sealed_codes_subnet_is_chosen_and_never_guessed
2026-08-18T00:58:09.3910101Z         PASS [   0.096s] ( 116/2564) spt::bin/spt cli::tests::a_sender_rule_on_a_non_attributable_surface_is_refused
2026-08-18T00:58:09.3979877Z         PASS [   0.092s] ( 117/2564) spt::bin/spt cli::tests::a_status_row_reads_held_over_running_and_carries_its_evidence
2026-08-18T00:58:09.4078977Z         PASS [   0.088s] ( 118/2564) spt::bin/spt cli::tests::a_subcommand_name_beats_the_bare_target
2026-08-18T00:58:09.4381540Z         PASS [   0.100s] ( 119/2564) spt::bin/spt cli::tests::adapter_add_transport_flags_parse
2026-08-18T00:58:09.4382181Z         PASS [   0.106s] ( 120/2564) spt::bin/spt cli::tests::access_subcommands_parse
2026-08-18T00:58:09.4418996Z         PASS [   0.421s] ( 121/2564) spt::bin/spt api::worker::tests::worker_poll_holds_deferred_while_resting
2026-08-18T00:58:09.4553294Z         PASS [   0.069s] ( 122/2564) spt::bin/spt cli::tests::adapter_name_validation_flags_every_unknown
2026-08-18T00:58:09.4638472Z         PASS [   0.070s] ( 123/2564) spt::bin/spt cli::tests::adapter_names_comma_list_parses_and_refuses_empties
2026-08-18T00:58:09.4929773Z         PASS [   0.145s] ( 124/2564) spt::bin/spt cli::tests::adapter_has_live_endpoint_detects_matching_live_perch
2026-08-18T00:58:09.5220786Z         PASS [   0.066s] ( 125/2564) spt::bin/spt cli::tests::adapter_update_install_dir_is_registered_source_dir_not_repo_name
2026-08-18T00:58:09.5454178Z         PASS [   0.513s] ( 126/2564) spt::bin/spt api::worker::tests::worker_poll_drains_spool
2026-08-18T00:58:09.5517679Z         PASS [   0.110s] ( 127/2564) spt::bin/spt cli::tests::adapter_translate_proof_parses
2026-08-18T00:58:09.5539112Z         PASS [   0.179s] ( 128/2564) spt::bin/spt cli::tests::adapter_has_live_endpoint_false_for_other_or_dead
2026-08-18T00:58:09.5543757Z         PASS [   0.142s] ( 129/2564) spt::bin/spt cli::tests::adapter_string_verbs
2026-08-18T00:58:09.5544507Z         PASS [   0.153s] ( 130/2564) spt::bin/spt cli::tests::adapter_profile_verbs_local_only
2026-08-18T00:58:09.5610894Z         PASS [   0.128s] ( 131/2564) spt::bin/spt cli::tests::adapter_subcommands_parse
2026-08-18T00:58:09.5690116Z         PASS [   0.244s] ( 132/2564) spt::bin/spt cli::tests::a_wedged_probe_costs_one_ceiling_and_reads_unknown_not_offline
2026-08-18T00:58:09.5696283Z         PASS [   0.108s] ( 133/2564) spt::bin/spt cli::tests::adapter_update_notice_absent_when_no_message
2026-08-18T00:58:09.5755778Z         PASS [   0.083s] ( 134/2564) spt::bin/spt cli::tests::adapter_update_notice_renders_declared_message_markdown
2026-08-18T00:58:09.6422719Z         PASS [   0.118s] ( 135/2564) spt::bin/spt cli::tests::adapter_update_summary_and_exit_aggregate_isolated_failures
2026-08-18T00:58:09.6734642Z         PASS [   0.102s] ( 136/2564) spt::bin/spt cli::tests::agent_ground_describes_itself_exactly_as_the_ceremony_always_did
2026-08-18T00:58:09.6735521Z         PASS [   0.096s] ( 137/2564) spt::bin/spt cli::tests::an_addressed_target_is_local_only_when_its_node_half_names_this_node
2026-08-18T00:58:09.6745445Z         PASS [   0.119s] ( 138/2564) spt::bin/spt cli::tests::all_hidden_this_node_suppresses_no_perches_marker
2026-08-18T00:58:09.6746126Z         PASS [   0.120s] ( 139/2564) spt::bin/spt cli::tests::adapter_version_parses
2026-08-18T00:58:09.6756693Z         PASS [   0.112s] ( 140/2564) spt::bin/spt cli::tests::already_applied_message_reads_up_to_date_no_restart
2026-08-18T00:58:09.7140982Z         PASS [   0.134s] ( 141/2564) spt::bin/spt cli::tests::adapter_version_surfaces_declared_adapter_version
2026-08-18T00:58:09.7197252Z         PASS [   0.161s] ( 142/2564) spt::bin/spt cli::tests::adapter_use_sets_and_clears_pointer
2026-08-18T00:58:09.7716116Z         PASS [   0.168s] ( 143/2564) spt::bin/spt cli::tests::an_approval_binds_the_subject_the_knocks_origin_implies
2026-08-18T00:58:09.7728147Z         PASS [   0.097s] ( 144/2564) spt::bin/spt cli::tests::an_empty_unlisted_set_renders_no_heading_at_all
2026-08-18T00:58:09.7768371Z         PASS [   0.106s] ( 145/2564) spt::bin/spt cli::tests::answering_verbs_declare_no_directionality
2026-08-18T00:58:09.8067670Z         PASS [   0.135s] ( 146/2564) spt::bin/spt cli::tests::an_excluded_knock_is_neither_a_landing_nor_a_wire_refusal
2026-08-18T00:58:09.8734644Z         PASS [   0.231s] ( 147/2564) spt::bin/spt cli::tests::an_empty_stored_surface_list_still_means_every_surface
2026-08-18T00:58:09.8884665Z         PASS [   0.152s] ( 148/2564) spt::bin/spt cli::tests::an_undelivered_receipt_reports_only_the_receipt
2026-08-18T00:58:09.8885435Z         PASS [   0.162s] ( 149/2564) spt::bin/spt cli::tests::any_single_evidence_source_is_enough_and_only_nothing_refuses
2026-08-18T00:58:09.9011560Z         PASS [   0.157s] ( 150/2564) spt::bin/spt cli::tests::api_adapter_flag_is_group_level_not_post_subcommand
2026-08-18T00:58:09.9012131Z         PASS [   0.180s] ( 151/2564) spt::bin/spt cli::tests::api_listen_accepts_session_id_flag
2026-08-18T00:58:09.9014026Z         PASS [   0.162s] ( 152/2564) spt::bin/spt cli::tests::applied_message_appends_restart_required_notice
2026-08-18T00:58:09.9017201Z         PASS [   0.079s] ( 153/2564) spt::bin/spt cli::tests::bare_tty_guard
2026-08-18T00:58:09.9184282Z         PASS [   0.075s] ( 154/2564) spt::bin/spt cli::tests::both_knock_answer_surfaces_take_a_monic
2026-08-18T00:58:09.9198128Z         PASS [   0.084s] ( 155/2564) spt::bin/spt cli::tests::bare_update_parses_composite_flags
2026-08-18T00:58:09.9199441Z         PASS [   0.112s] ( 156/2564) spt::bin/spt cli::tests::bare_spt_parses_to_none
2026-08-18T00:58:09.9300048Z         PASS [   0.126s] ( 157/2564) spt::bin/spt cli::tests::apply_user_msg_gate_local_origination
2026-08-18T00:58:09.9350702Z         PASS [   0.189s] ( 158/2564) spt::bin/spt cli::tests::applied_message_renders_semver_or_counter_fallback_and_states_applied
2026-08-18T00:58:09.9630028Z         PASS [   0.092s] ( 159/2564) spt::bin/spt cli::tests::broker_image_line_reports_without_warning_or_remedy
2026-08-18T00:58:09.9928645Z         PASS [   0.639s] ( 160/2564) spt::bin/spt cli::tests::adapter_digest_proof_gates_on_drops
2026-08-18T00:58:09.9929258Z         PASS [   0.092s] ( 161/2564) spt::bin/spt cli::tests::classify_fetch_reject_matrix
2026-08-18T00:58:10.0018814Z         PASS [   0.091s] ( 162/2564) spt::bin/spt cli::tests::classify_flat_archive_never_misfires
2026-08-18T00:58:10.0050442Z         PASS [   0.087s] ( 163/2564) spt::bin/spt cli::tests::classify_multiplatform_captures_only_known_triples
2026-08-18T00:58:10.0058819Z         PASS [   0.087s] ( 164/2564) spt::bin/spt cli::tests::cli_send_stamps_cli_at_node_origin
2026-08-18T00:58:10.0181866Z         PASS [   0.096s] ( 165/2564) spt::bin/spt cli::tests::composite_plans_core_first_and_core_only_skips_adapters
2026-08-18T00:58:10.0182590Z         PASS [   0.091s] ( 166/2564) spt::bin/spt cli::tests::connection_lines_net_less_hides_stale_heartbeat
2026-08-18T00:58:10.0193512Z         PASS [   0.681s] ( 167/2564) spt::bin/spt cli::tests::adapter_digest_proof_fills_session_id_key
2026-08-18T00:58:10.0737148Z         PASS [   0.147s] ( 168/2564) spt::bin/spt cli::tests::coordinator_image_line_is_the_only_stale_warning
2026-08-18T00:58:10.0818193Z         PASS [   0.119s] ( 169/2564) spt::bin/spt cli::tests::create_existing_name_is_usage_error
2026-08-18T00:58:10.0892459Z         PASS [   0.110s] ( 170/2564) spt::bin/spt cli::tests::create_mints_two_distinct_keys_and_records_the_mode
2026-08-18T00:58:10.0934993Z         PASS [   0.101s] ( 171/2564) spt::bin/spt cli::tests::create_mode_is_never_preselected
2026-08-18T00:58:10.0975937Z         PASS [   0.105s] ( 172/2564) spt::bin/spt cli::tests::create_new_existing_name_is_usage_error
2026-08-18T00:58:10.1126468Z         PASS [   0.107s] ( 173/2564) spt::bin/spt cli::tests::create_not_elevated_refuses_without_saving
2026-08-18T00:58:10.1147886Z         PASS [   1.004s] ( 174/2564) spt::bin/spt cli::reserved_id_tests::rename_into_the_reserved_id_is_refused
2026-08-18T00:58:10.1192192Z         PASS [   0.116s] ( 175/2564) spt::bin/spt cli::tests::create_new_mints_shows_and_requests_save
2026-08-18T00:58:10.1308182Z         PASS [   0.109s] ( 176/2564) spt::bin/spt cli::tests::cross_node_after_filters_a_sealed_turn_exactly_like_the_local_path
2026-08-18T00:58:10.1342078Z         PASS [   0.116s] ( 177/2564) spt::bin/spt cli::tests::create_prints_joining_material_when_elevated
2026-08-18T00:58:10.1417304Z         PASS [   0.065s] ( 178/2564) spt::bin/spt cli::tests::daemon_offline_hint_only_when_down
2026-08-18T00:58:10.1691737Z         PASS [   0.076s] ( 179/2564) spt::bin/spt cli::tests::daemon_refresh_verb_parses
2026-08-18T00:58:10.1692454Z         PASS [   0.066s] ( 180/2564) spt::bin/spt cli::tests::daemonless_apply_message_points_at_finish_or_start
2026-08-18T00:58:10.1788942Z         PASS [   0.162s] ( 181/2564) spt::bin/spt cli::tests::create_provisions_the_admin_key_and_show_code_never_does
2026-08-18T00:58:10.1805603Z         PASS [   0.083s] ( 182/2564) spt::bin/spt cli::tests::deferred_elevation_gate_matrix
2026-08-18T00:58:10.1824808Z         PASS [   0.070s] ( 183/2564) spt::bin/spt cli::tests::digest_cursor_flags_parse
2026-08-18T00:58:10.1856892Z         PASS [   0.066s] ( 184/2564) spt::bin/spt cli::tests::digest_human_path_keeps_the_stderr_trailer
2026-08-18T00:58:10.1869759Z         PASS [   0.096s] ( 185/2564) spt::bin/spt cli::tests::daemon_subcommands_parse
2026-08-18T00:58:10.1875687Z         PASS [   0.073s] ( 186/2564) spt::bin/spt cli::tests::digest_flag_defaults
2026-08-18T00:58:10.1877061Z         PASS [   0.059s] ( 187/2564) spt::bin/spt cli::tests::digest_json_carries_version_and_leaves_stderr_clean
2026-08-18T00:58:10.1928416Z         PASS [   0.061s] ( 188/2564) spt::bin/spt cli::tests::digest_json_predates_path_still_carries_version
2026-08-18T00:58:10.1954031Z         PASS [   0.057s] ( 189/2564) spt::bin/spt cli::tests::empty_store_no_flag_guides_to_pair_or_create
2026-08-18T00:58:10.2001483Z         PASS [   0.043s] ( 190/2564) spt::bin/spt cli::tests::endpoint_caller_is_denied_and_a_human_caller_is_not
2026-08-18T00:58:10.2078420Z         PASS [   0.432s] ( 191/2564) spt::bin/spt cli::tests::apply_release_crc_swap_only_swaps_changed
2026-08-18T00:58:10.2751276Z         PASS [   0.096s] ( 192/2564) spt::bin/spt cli::tests::endpoint_role_parses
2026-08-18T00:58:10.2775357Z         PASS [   0.097s] ( 193/2564) spt::bin/spt cli::tests::endpoint_row_json_endpoint_type_is_additive
2026-08-18T00:58:10.2903797Z         PASS [   0.105s] ( 194/2564) spt::bin/spt cli::tests::engine_room_ceremony_decision_table
2026-08-18T00:58:10.2929693Z         PASS [   0.105s] ( 195/2564) spt::bin/spt cli::tests::engine_room_purge_resets_under_elevation_and_refuses_without_it
2026-08-18T00:58:10.2990266Z         PASS [   0.111s] ( 196/2564) spt::bin/spt cli::tests::escalation_choice_parses_fail_closed
2026-08-18T00:58:10.3096241Z         PASS [   0.117s] ( 197/2564) spt::bin/spt cli::tests::every_mint_persist_site_asks_the_shared_probe
2026-08-18T00:58:10.3126929Z         PASS [   0.127s] ( 198/2564) spt::bin/spt cli::tests::endpoint_subcommands_parse
2026-08-18T00:58:10.3211644Z         PASS [   0.113s] ( 199/2564) spt::bin/spt cli::tests::every_send_outcome_is_answered_by_exactly_one_renderer
2026-08-18T00:58:10.3437083Z         PASS [   0.143s] ( 200/2564) spt::bin/spt cli::tests::every_read_status_command_accepts_the_global_json_flag
2026-08-18T00:58:10.3540737Z         PASS [   0.061s] ( 201/2564) spt::bin/spt cli::tests::fetch_reject_action_apply_decision
2026-08-18T00:58:10.3589752Z         PASS [   0.163s] ( 202/2564) spt::bin/spt cli::tests::every_node_subcommand_parses_identically_under_the_daemon_alias
2026-08-18T00:58:10.3604822Z         PASS [   0.061s] ( 203/2564) spt::bin/spt cli::tests::filter_after_excludes_at_or_below_cursor
2026-08-18T00:58:10.3644671Z         PASS [   0.054s] ( 204/2564) spt::bin/spt cli::tests::filter_after_predates_window_returns_full
2026-08-18T00:58:10.3681710Z         PASS [   0.055s] ( 205/2564) spt::bin/spt cli::tests::finish_message_states_fully_live_no_manual_restart
2026-08-18T00:58:10.3800778Z         PASS [   0.037s] ( 206/2564) spt::bin/spt cli::tests::gh_download_command_no_tag_omits_tag
2026-08-18T00:58:10.3873654Z         PASS [   0.033s] ( 207/2564) spt::bin/spt cli::tests::gh_download_command_with_tag_shape
2026-08-18T00:58:10.3920789Z         PASS [   0.033s] ( 208/2564) spt::bin/spt cli::tests::gh_failure_classes_render_os_correct_hints
2026-08-18T00:58:10.3975462Z         PASS [   0.037s] ( 209/2564) spt::bin/spt cli::tests::gh_release_version_compare_decision
2026-08-18T00:58:10.4012092Z         PASS [   0.126s] ( 210/2564) spt::bin/spt cli::tests::extract_legacy_flat_stays_flat
2026-08-18T00:58:10.4024111Z         PASS [   0.039s] ( 211/2564) spt::bin/spt cli::tests::gh_version_command_shape
2026-08-18T00:58:10.4142647Z         PASS [   0.137s] ( 212/2564) spt::bin/spt cli::tests::extract_multiplatform_missing_my_triple_is_typed_rejection
2026-08-18T00:58:10.4195434Z         PASS [   0.129s] ( 213/2564) spt::bin/spt cli::tests::extract_multiplatform_places_shared_root_and_flattens_my_triple
2026-08-18T00:58:10.4468948Z         PASS [   0.264s] ( 214/2564) spt::bin/spt cli::tests::endpoint_stop_marks_offline
2026-08-18T00:58:10.4692921Z         PASS [   0.101s] ( 215/2564) spt::bin/spt cli::tests::grant_subcommands_parse
2026-08-18T00:58:10.4751675Z         PASS [   0.095s] ( 216/2564) spt::bin/spt cli::tests::help_groups_cover_every_command
2026-08-18T00:58:10.5448228Z         PASS [   0.892s] ( 217/2564) spt::bin/spt cli::tests::an_engine_room_reset_wipes_records_but_never_deletes_the_engine_room
2026-08-18T00:58:10.8912284Z         PASS [   0.493s] ( 218/2564) spt::bin/spt cli::tests::inbound_json_speaks_in_the_two_states_the_human_view_is_silent_in
2026-08-18T00:58:10.8932838Z         PASS [   0.501s] ( 219/2564) spt::bin/spt cli::tests::how_to_topics_cover_ready_and_send
2026-08-18T00:58:10.8979319Z         PASS [   0.497s] ( 220/2564) spt::bin/spt cli::tests::inbound_verdict_rides_the_json_in_every_state_including_ok
2026-08-18T00:58:10.9030495Z         PASS [   0.516s] ( 221/2564) spt::bin/spt cli::tests::hot_path_flat_and_moved_verbs_gone
2026-08-18T00:58:10.9068864Z         PASS [   0.493s] ( 222/2564) spt::bin/spt cli::tests::install_platform_check_gates_stamp_and_host_arch
2026-08-18T00:58:10.9133411Z         PASS [   0.493s] ( 223/2564) spt::bin/spt cli::tests::instance_rows_palette_and_align
2026-08-18T00:58:10.9152552Z         PASS [   0.513s] ( 224/2564) spt::bin/spt cli::tests::install_place_is_idempotent_and_path_block_detected
2026-08-18T00:58:10.9193558Z         PASS [   0.473s] ( 225/2564) spt::bin/spt cli::tests::instance_rows_project_column
2026-08-18T00:58:10.9270156Z         PASS [   0.458s] ( 226/2564) spt::bin/spt cli::tests::invalid_usage_errors
2026-08-18T00:58:10.9290474Z         PASS [   0.454s] ( 227/2564) spt::bin/spt cli::tests::join_gate_refuses_without_confirmed_elevation
2026-08-18T00:58:10.9333251Z         PASS [   0.389s] ( 228/2564) spt::bin/spt cli::tests::json_activity_key_is_local_only_and_skips_when_unknown
2026-08-18T00:58:10.9379271Z         PASS [   0.047s] ( 229/2564) spt::bin/spt cli::tests::json_activity_words_come_from_the_shared_vocabulary_source
2026-08-18T00:58:10.9422915Z         PASS [   0.049s] ( 230/2564) spt::bin/spt cli::tests::json_payload_rides_as_attr_alongside_body
2026-08-18T00:58:10.9473238Z         PASS [   0.049s] ( 231/2564) spt::bin/spt cli::tests::json_project_field_skip_if_none
2026-08-18T00:58:10.9511986Z         PASS [   0.048s] ( 232/2564) spt::bin/spt cli::tests::knock_surfaces_speaks_the_tables_vocabulary_and_refuses_the_rest
2026-08-18T00:58:10.9566265Z         PASS [   0.050s] ( 233/2564) spt::bin/spt cli::tests::local_dtos_carry_host_error_and_omit_it_when_clean
2026-08-18T00:58:10.9622791Z         PASS [   0.049s] ( 234/2564) spt::bin/spt cli::tests::malformed_tuple_flags_refuse_with_a_usable_diagnostic
2026-08-18T00:58:10.9826517Z         PASS [   0.055s] ( 235/2564) spt::bin/spt cli::tests::new_code_carries_the_acknowledgment_and_the_subnet_through_the_router
2026-08-18T00:58:10.9840467Z         PASS [   0.055s] ( 236/2564) spt::bin/spt cli::tests::no_redeem_surface_claims_a_reverse_the_minting_side_could_not_open
2026-08-18T00:58:10.9875856Z         PASS [   0.068s] ( 237/2564) spt::bin/spt cli::tests::multi_subnet_refuses_without_flag_then_resolves_with_it
2026-08-18T00:58:10.9898551Z         PASS [   0.056s] ( 238/2564) spt::bin/spt cli::tests::node_group_discards_self_and_skips_empty
2026-08-18T00:58:10.9905696Z         PASS [   0.075s] ( 239/2564) spt::bin/spt cli::tests::monic_verbs_parse
2026-08-18T00:58:11.0413868Z         PASS [   0.102s] ( 240/2564) spt::bin/spt cli::tests::node_group_freshest_epoch_wins_and_unions_subnets
2026-08-18T00:58:11.0462939Z         PASS [   0.104s] ( 241/2564) spt::bin/spt cli::tests::node_group_same_id_two_nodes_two_groups
2026-08-18T00:58:11.0553320Z         PASS [   0.105s] ( 242/2564) spt::bin/spt cli::tests::node_grouped_render_structure_and_palette
2026-08-18T00:58:11.0589209Z         PASS [   0.108s] ( 243/2564) spt::bin/spt cli::tests::node_level_label_names_an_endpointless_peer
2026-08-18T00:58:11.0642648Z         PASS [   0.108s] ( 244/2564) spt::bin/spt cli::tests::node_rows_disambiguate_only_on_label_collision
2026-08-18T00:58:11.0694879Z         PASS [   0.107s] ( 245/2564) spt::bin/spt cli::tests::node_status_rows_denominator_counts_routable_only
2026-08-18T00:58:11.0738637Z         PASS [   0.091s] ( 246/2564) spt::bin/spt cli::tests::node_status_rows_settle_cheap_signals_probe_only_stale
2026-08-18T00:58:11.0776667Z         PASS [   0.094s] ( 247/2564) spt::bin/spt cli::tests::not_elevated_refuses_without_leaking_code_or_saving
2026-08-18T00:58:11.0832633Z         PASS [   0.096s] ( 248/2564) spt::bin/spt cli::tests::notify_subnet_resolution_home_default
2026-08-18T00:58:11.0910438Z         PASS [   0.101s] ( 249/2564) spt::bin/spt cli::tests::only_a_bake_that_can_admit_the_whole_node_demands_the_acknowledgment
2026-08-18T00:58:11.0943015Z         PASS [   0.104s] ( 250/2564) spt::bin/spt cli::tests::notify_surface_parses
2026-08-18T00:58:11.0952210Z         PASS [   0.055s] ( 251/2564) spt::bin/spt cli::tests::only_rows_with_a_node_are_asked_and_answers_land_on_their_own_row
2026-08-18T00:58:11.0994751Z         PASS [   0.053s] ( 252/2564) spt::bin/spt cli::tests::only_the_send_side_defaults_to_msg
2026-08-18T00:58:11.1032952Z         PASS [   0.050s] ( 253/2564) spt::bin/spt cli::tests::origin_asset_urls_latest_and_tag
2026-08-18T00:58:11.1075299Z         PASS [   0.049s] ( 254/2564) spt::bin/spt cli::tests::own_nested_section_renders_under_this_node_without_moving_the_total
2026-08-18T00:58:11.1195789Z         PASS [   0.050s] ( 255/2564) spt::bin/spt cli::tests::pair_namespace_is_gone
2026-08-18T00:58:11.1212432Z         PASS [   0.047s] ( 256/2564) spt::bin/spt cli::tests::peer_health_line_names_absent_peers_as_their_own_state
2026-08-18T00:58:11.1262965Z         PASS [   0.049s] ( 257/2564) spt::bin/spt cli::tests::peer_health_line_names_the_stage_and_stays_silent_when_idle
2026-08-18T00:58:11.1305311Z         PASS [   0.047s] ( 258/2564) spt::bin/spt cli::tests::poll_until_ready_fastpath_timeout_and_later_success
2026-08-18T00:58:11.1349592Z         PASS [   0.044s] ( 259/2564) spt::bin/spt cli::tests::post_step_notice_arbitration
2026-08-18T00:58:11.1415536Z         PASS [   0.047s] ( 260/2564) spt::bin/spt cli::tests::probe_all_cap_batches_into_windows
2026-08-18T00:58:11.1557122Z         PASS [   0.052s] ( 261/2564) spt::bin/spt cli::tests::project_index_line_states_health_not_presence
2026-08-18T00:58:11.1645491Z         PASS [   0.057s] ( 262/2564) spt::bin/spt cli::tests::prune_candidates_resolve_never_guess
2026-08-18T00:58:11.1694202Z         PASS [   0.050s] ( 263/2564) spt::bin/spt cli::tests::psyche_companion_is_named_without_a_status
2026-08-18T00:58:11.2528882Z         PASS [   0.085s] ( 264/2564) spt::bin/spt cli::tests::remote_cell_project_ref_from_gossiped_recent_projects
2026-08-18T00:58:11.2579496Z         PASS [   0.088s] ( 265/2564) spt::bin/spt cli::tests::requesting_verbs_force_an_explicit_directionality
2026-08-18T00:58:11.2678230Z         PASS [   0.146s] ( 266/2564) spt::bin/spt cli::tests::public_help_carries_no_internal_codes_at_any_ruled_site
2026-08-18T00:58:11.2804669Z         PASS [   0.022s] ( 267/2564) spt::bin/spt cli::tests::resolve_transport_auto_follows_probe
2026-08-18T00:58:11.2842102Z         PASS [   0.035s] ( 268/2564) spt::bin/spt cli::tests::resolve_proof_target_override_reads_on_disk
2026-08-18T00:58:11.2849499Z         PASS [   0.154s] ( 269/2564) spt::bin/spt cli::tests::purge_offline_gate_and_self_guard
2026-08-18T00:58:11.2875374Z         PASS [   0.146s] ( 270/2564) spt::bin/spt cli::tests::registered_github_home_detects_active_collision
2026-08-18T00:58:11.2919681Z         PASS [   0.024s] ( 271/2564) spt::bin/spt cli::tests::resolve_transport_explicit_never_probes
2026-08-18T00:58:11.2972833Z         PASS [   0.017s] ( 272/2564) spt::bin/spt cli::tests::rest_filter_hides_suspended_shows_all_and_corrupt_always
2026-08-18T00:58:11.3010170Z         PASS [   0.201s] ( 273/2564) spt::bin/spt cli::tests::probe_all_timeout_settles_false_without_stalling_batch
2026-08-18T00:58:11.3024891Z         PASS [   0.018s] ( 274/2564) spt::bin/spt cli::tests::rest_filter_status_first_ordering
2026-08-18T00:58:11.3080715Z         PASS [   0.023s] ( 275/2564) spt::bin/spt cli::tests::rest_filter_total_disclosure_and_corrupt_annotation
2026-08-18T00:58:11.3132057Z         PASS [   0.026s] ( 276/2564) spt::bin/spt cli::tests::restart_plans_lethal_leg_last
2026-08-18T00:58:11.3207654Z         PASS [   0.029s] ( 277/2564) spt::bin/spt cli::tests::ring_no_reply_arms_report_the_wait_in_the_callers_unit
2026-08-18T00:58:11.3274992Z         PASS [   0.030s] ( 278/2564) spt::bin/spt cli::tests::ring_timeout_defaults
2026-08-18T00:58:11.3320625Z         PASS [   0.031s] ( 279/2564) spt::bin/spt cli::tests::ring_timeout_parses_bare_as_minutes_and_honors_suffixes
2026-08-18T00:58:11.3450518Z         PASS [   0.036s] ( 280/2564) spt::bin/spt cli::tests::self_endpoint_line_reports_the_live_relay_or_says_there_is_none
2026-08-18T00:58:11.3464383Z         PASS [   0.251s] ( 281/2564) spt::bin/spt cli::tests::probe_all_runs_concurrently_in_input_order
2026-08-18T00:58:11.3489513Z         PASS [   0.036s] ( 282/2564) spt::bin/spt cli::tests::self_pin_annotates_host_error
2026-08-18T00:58:11.3527414Z         PASS [   0.197s] ( 283/2564) spt::bin/spt cli::tests::release_archive_extracts_to_a_registrable_root
2026-08-18T00:58:11.3555002Z         PASS [   0.035s] ( 284/2564) spt::bin/spt cli::tests::self_pin_annotates_psyche_host_failure
2026-08-18T00:58:11.3606057Z         PASS [   0.033s] ( 285/2564) spt::bin/spt cli::tests::self_pin_annotates_translation_fault
2026-08-18T00:58:11.3650865Z         PASS [   0.033s] ( 286/2564) spt::bin/spt cli::tests::self_pin_includes_description_when_present
2026-08-18T00:58:11.3931125Z         PASS [   0.091s] ( 287/2564) spt::bin/spt cli::tests::run_bounded_yields_value_or_timeout_default
2026-08-18T00:58:11.4208463Z         PASS [   0.076s] ( 288/2564) spt::bin/spt cli::tests::send_reply_to_flag_is_removed_and_target_required
2026-08-18T00:58:11.4246834Z         PASS [   0.078s] ( 289/2564) spt::bin/spt cli::tests::send_user_msg_flag_parses
2026-08-18T00:58:11.5331571Z         PASS [   0.104s] ( 290/2564) spt::bin/spt cli::tests::shell_subcommands_parse
2026-08-18T00:58:11.5550340Z         PASS [   0.202s] ( 291/2564) spt::bin/spt cli::tests::shell_owner_exclusivity_negatives
2026-08-18T00:58:11.5802110Z         PASS [   0.052s] ( 292/2564) spt::bin/spt cli::tests::show_code_prints_reprovisioning_material
2026-08-18T00:58:11.7710983Z         PASS [   0.328s] ( 293/2564) spt::bin/spt cli::tests::shell_spawn_profiled_option_resolves_and_shares_cap
2026-08-18T00:58:12.4664169Z         PASS [   1.110s] ( 294/2564) spt::bin/spt cli::tests::shell_relink_relaunches_offline_instances_only
2026-08-18T00:58:12.5623724Z         PASS [   0.991s] ( 295/2564) spt::bin/spt cli::tests::shutdown_and_stop_share_the_postcondition_and_differ_only_in_ceremony
2026-08-18T00:58:12.5624525Z         PASS [   0.808s] ( 296/2564) spt::bin/spt cli::tests::shutdown_on_a_harness_hosted_endpoint_claims_no_process
2026-08-18T00:58:12.5933575Z         PASS [   0.127s] ( 297/2564) spt::bin/spt cli::tests::single_subnet_auto_selects_and_code_matches_seed
2026-08-18T00:58:12.6257601Z         PASS [   1.045s] ( 298/2564) spt::bin/spt cli::tests::shutdown_on_a_broker_hosted_endpoint_stamps_after_the_reap
2026-08-18T00:58:12.6375664Z         PASS [   2.479s] ( 299/2564) spt::bin/spt cli::tests::endpoint_role_overwrite_is_the_sole_writer
2026-08-18T00:58:12.7207650Z         PASS [   1.372s] ( 300/2564) spt::bin/spt cli::tests::shell_channels_relay_sensory_and_text_file
2026-08-18T00:58:12.8162278Z         PASS [   1.437s] ( 301/2564) spt::bin/spt cli::tests::shell_spawn_approval_floor_gates
2026-08-18T00:58:12.8162877Z         PASS [   1.441s] ( 302/2564) spt::bin/spt cli::tests::shell_spawn_cap_and_over_cap_gates
2026-08-18T00:58:12.9145242Z         PASS [   0.276s] ( 303/2564) spt::bin/spt cli::tests::stall_evict_line_surfaces_only_a_real_tally
2026-08-18T00:58:12.9177414Z         PASS [   0.197s] ( 304/2564) spt::bin/spt cli::tests::stop_guard_refuses_live_sessions_without_force
2026-08-18T00:58:12.9219936Z         PASS [   0.365s] ( 305/2564) spt::bin/spt cli::tests::stage_then_swap_failed_fetch_preserves_install
2026-08-18T00:58:12.9361493Z         PASS [   0.138s] ( 306/2564) spt::bin/spt cli::tests::subcommands_parse
2026-08-18T00:58:12.9520116Z         PASS [   0.145s] ( 307/2564) spt::bin/spt cli::tests::subnet_arg_shapes_parse
2026-08-18T00:58:12.9804603Z         PASS [   0.065s] ( 308/2564) spt::bin/spt cli::tests::subnet_mode_lines_state_declared_captured_and_pending
2026-08-18T00:58:12.9913386Z         PASS [   0.071s] ( 309/2564) spt::bin/spt cli::tests::subnet_status_renders_rows_and_hints_never_secrets
2026-08-18T00:58:13.0013835Z         PASS [   0.078s] ( 310/2564) spt::bin/spt cli::tests::subnets_joined_banner_renders_rows_and_divider
2026-08-18T00:58:13.0134772Z         PASS [   0.077s] ( 311/2564) spt::bin/spt cli::tests::subprocess_detail_prefers_stderr_then_stdout
2026-08-18T00:58:13.0182866Z         PASS [   0.425s] ( 312/2564) spt::bin/spt cli::tests::staged_floor_admits_when_core_meets_floor
2026-08-18T00:58:13.0262015Z         PASS [   0.074s] ( 313/2564) spt::bin/spt cli::tests::the_bare_form_is_the_send_form
2026-08-18T00:58:13.0278577Z         PASS [   0.048s] ( 314/2564) spt::bin/spt cli::tests::the_bare_form_refuses_rather_than_guessing
2026-08-18T00:58:13.0287222Z         PASS [   0.482s] ( 315/2564) spt::bin/spt cli::tests::spt_hosted_no_relay_detection
2026-08-18T00:58:13.0318374Z         PASS [   0.032s] ( 316/2564) spt::bin/spt cli::tests::the_bare_status_view_states_the_mode_facts_for_every_row
2026-08-18T00:58:13.0320860Z         PASS [   0.043s] ( 317/2564) spt::bin/spt cli::tests::the_bare_node_verb_defaults_to_the_status_view_under_both_spellings
2026-08-18T00:58:13.0449644Z         PASS [   0.419s] ( 318/2564) spt::bin/spt cli::tests::staged_floor_refuses_above_floor_and_leaves_dest_untouched
2026-08-18T00:58:13.0908894Z         PASS [   0.073s] ( 319/2564) spt::bin/spt cli::tests::the_conjunction_notice_fires_per_missing_half_and_stays_silent_when_both_hold
2026-08-18T00:58:13.0950917Z         PASS [   0.068s] ( 320/2564) spt::bin/spt cli::tests::the_conjunction_notice_names_the_whitelist_its_seat_and_the_posture
2026-08-18T00:58:13.1126360Z         PASS [   0.098s] ( 321/2564) spt::bin/spt cli::tests::the_briefing_prescribes_only_verbs_the_grammar_has
2026-08-18T00:58:13.1196392Z         PASS [   0.090s] ( 322/2564) spt::bin/spt cli::tests::the_cross_node_mutual_refusal_is_gone_from_every_surface_that_carried_it
2026-08-18T00:58:13.1204618Z         PASS [   0.092s] ( 323/2564) spt::bin/spt cli::tests::the_create_ceremony_names_the_heal_for_an_older_minter
2026-08-18T00:58:13.1205603Z         PASS [   0.088s] ( 324/2564) spt::bin/spt cli::tests::the_denial_names_the_blast_radius_and_a_cure_that_fits_its_ground
2026-08-18T00:58:13.1346291Z         PASS [   0.090s] ( 325/2564) spt::bin/spt cli::tests::the_engine_room_briefing_speaks_the_cli_vocabulary
2026-08-18T00:58:13.1447347Z         PASS [   0.113s] ( 326/2564) spt::bin/spt cli::tests::the_deprecation_note_renders_on_both_spellings_of_the_node_verb
2026-08-18T00:58:13.1551753Z         PASS [   2.029s] ( 327/2564) spt::bin/spt cli::tests::purge_force_asks_before_it_tears_anything_down
2026-08-18T00:58:13.2032957Z         PASS [   0.091s] ( 328/2564) spt::bin/spt cli::tests::the_gc_render_says_what_it_refused_and_what_it_would_delete
2026-08-18T00:58:13.2078143Z         PASS [   0.116s] ( 329/2564) spt::bin/spt cli::tests::the_evidence_census_reads_each_local_source
2026-08-18T00:58:13.2103761Z         PASS [   0.092s] ( 330/2564) spt::bin/spt cli::tests::the_human_and_json_legs_agree_on_every_unlisted_row
2026-08-18T00:58:13.2142842Z         PASS [   0.095s] ( 331/2564) spt::bin/spt cli::tests::the_legacy_allow_echo_says_discover_is_untouched_and_scopes_both_levers
2026-08-18T00:58:13.2165525Z         PASS [   0.122s] ( 332/2564) spt::bin/spt cli::tests::the_flagless_access_listing_is_wired_distinctly_from_its_subcommands
2026-08-18T00:58:13.2178624Z         PASS [   0.083s] ( 333/2564) spt::bin/spt cli::tests::the_mint_probe_answers_only_for_a_fresh_mint
2026-08-18T00:58:13.2265955Z         PASS [   0.071s] ( 334/2564) spt::bin/spt cli::tests::the_presenters_three_renderings_stay_three_things
2026-08-18T00:58:13.2320142Z         PASS [   0.030s] ( 335/2564) spt::bin/spt cli::tests::the_remote_knock_refusals_render_as_prose
2026-08-18T00:58:13.2365391Z         PASS [   0.030s] ( 336/2564) spt::bin/spt cli::tests::the_rendered_peer_fraction_counts_one_population_across_a_subnet_leave
2026-08-18T00:58:13.2478716Z         PASS [   0.037s] ( 337/2564) spt::bin/spt cli::tests::the_rendered_section_is_the_composers_output
2026-08-18T00:58:13.2557705Z         PASS [   0.038s] ( 338/2564) spt::bin/spt cli::tests::the_three_landings_render_distinct_lines
2026-08-18T00:58:13.2606490Z         PASS [   0.034s] ( 339/2564) spt::bin/spt cli::tests::the_three_send_outcomes_owe_three_different_receipts
2026-08-18T00:58:13.2676043Z         PASS [   0.035s] ( 340/2564) spt::bin/spt cli::tests::the_tuple_flags_build_the_rule_they_name
2026-08-18T00:58:13.2838116Z         PASS [   0.047s] ( 341/2564) spt::bin/spt cli::tests::the_unlisted_listing_drops_an_excluded_peer_and_keeps_the_rest
2026-08-18T00:58:13.2846591Z         PASS [   0.037s] ( 342/2564) spt::bin/spt cli::tests::the_unspooled_remedy_prescribes_a_verb_the_grammar_has
2026-08-18T00:58:13.3398810Z         PASS [   0.084s] ( 343/2564) spt::bin/spt cli::tests::the_visible_alias_reaches_the_root_listing
2026-08-18T00:58:13.3410318Z         PASS [   0.073s] ( 344/2564) spt::bin/spt cli::tests::this_node_group_merges_roster_with_unbound_truth
2026-08-18T00:58:13.3464786Z         PASS [   0.063s] ( 345/2564) spt::bin/spt cli::tests::trust_mutation_gate_refuses_without_confirmed_elevation
2026-08-18T00:58:13.3587578Z         PASS [   0.019s] ( 346/2564) spt::bin/spt cli::tests::unknown_elevation_falls_back
2026-08-18T00:58:13.3616857Z         PASS [   0.077s] ( 347/2564) spt::bin/spt cli::tests::trust_warning_verbs_parse
2026-08-18T00:58:13.3744744Z         PASS [   0.026s] ( 348/2564) spt::bin/spt cli::tests::unknown_named_subnet_is_usage_error
2026-08-18T00:58:13.3748859Z         PASS [   0.111s] ( 349/2564) spt::bin/spt cli::tests::the_widening_remedy_is_sited_with_its_flag_not_in_the_shared_section
2026-08-18T00:58:13.3761665Z         PASS [   0.159s] ( 350/2564) spt::bin/spt cli::tests::the_surface_section_rides_the_ruled_sites_and_no_others
2026-08-18T00:58:13.3789740Z         PASS [   0.032s] ( 351/2564) spt::bin/spt cli::tests::update_adapters_verb_parses_with_optional_names
2026-08-18T00:58:13.3873008Z         PASS [   0.028s] ( 352/2564) spt::bin/spt cli::tests::update_fetch_apply_flag_parses
2026-08-18T00:58:13.3906015Z         PASS [   0.023s] ( 353/2564) spt::bin/spt cli::tests::whoami_parses_as_the_identity_verb
2026-08-18T00:58:13.3932832Z         PASS [   0.031s] ( 354/2564) spt::bin/spt cli::tests::what_the_listing_prescribes_is_what_the_approve_path_honors
2026-08-18T00:58:13.3945806Z         PASS [   0.180s] ( 355/2564) spt::bin/spt cli::tests::the_seat_and_the_acknowledgment_are_the_mints_and_both_arms_refuse_alike
2026-08-18T00:58:13.4091308Z         PASS [   0.030s] ( 356/2564) spt::bin/spt elevation::tests::already_elevated_short_circuits_on_every_os
2026-08-18T00:58:13.4151197Z         PASS [   0.028s] ( 357/2564) spt::bin/spt elevation::tests::current_returns_a_determinate_level_on_supported_platforms
2026-08-18T00:58:13.4215516Z         PASS [   0.031s] ( 358/2564) spt::bin/spt elevation::tests::fallback_message_names_authenticator_app_and_subnet
2026-08-18T00:58:13.4222092Z         PASS [   0.050s] ( 359/2564) spt::bin/spt cli::verb_surface_route_table::every_bringup_door_routes_where_it_says
2026-08-18T00:58:13.4264403Z         PASS [   0.033s] ( 360/2564) spt::bin/spt elevation::tests::gate_shows_only_when_confirmed_elevated
2026-08-18T00:58:13.4319660Z         PASS [   0.037s] ( 361/2564) spt::bin/spt elevation::tests::launcher_argv_is_absolute_exe_plus_verbatim_args
2026-08-18T00:58:13.4386476Z         PASS [   0.062s] ( 362/2564) spt::bin/spt cli::verb_surface_route_table::the_exclusions_are_real_refusals
2026-08-18T00:58:13.4867447Z         PASS [   0.078s] ( 363/2564) spt::bin/spt elevation::tests::launchers_never_shell_interpolate_a_crafted_arg
2026-08-18T00:58:13.4926205Z         PASS [   0.077s] ( 364/2564) spt::bin/spt elevation::tests::print_hint_floor_uses_absolute_path_each_os
2026-08-18T00:58:13.4979554Z         PASS [   0.076s] ( 365/2564) spt::bin/spt elevation::tests::unix_path_order_tty_then_pkexec_then_terminal_then_hint
2026-08-18T00:58:13.5033409Z         PASS [   0.081s] ( 366/2564) spt::bin/spt elevation::tests::windows_uac_only_interactive_other_always_prints
2026-08-18T00:58:13.5073304Z         PASS [   0.387s] ( 367/2564) spt::bin/spt cli::tests::the_local_and_wire_arms_write_one_identical_grant
2026-08-18T00:58:13.5113348Z         PASS [   0.085s] ( 368/2564) spt::bin/spt helpfmt::tests::atx_header_at_line_start_strips_and_bolds
2026-08-18T00:58:13.5139714Z         PASS [   0.082s] ( 369/2564) spt::bin/spt helpfmt::tests::bold_styles_with_color_and_strips_without
2026-08-18T00:58:13.5191727Z         PASS [   0.080s] ( 370/2564) spt::bin/spt helpfmt::tests::code_styles_with_color_and_strips_without
2026-08-18T00:58:13.5238526Z         PASS [   0.037s] ( 371/2564) spt::bin/spt helpfmt::tests::color_enabled_truth_table
2026-08-18T00:58:13.5283925Z         PASS [   0.036s] ( 372/2564) spt::bin/spt helpfmt::tests::dual_contract_token_survives_strip_mode
2026-08-18T00:58:13.5334464Z         PASS [   0.035s] ( 373/2564) spt::bin/spt helpfmt::tests::dual_contract_token_unstyled_while_prose_styles_on_color
2026-08-18T00:58:13.5392217Z         PASS [   0.036s] ( 374/2564) spt::bin/spt helpfmt::tests::empty_and_unmatched_markers_stay_literal
2026-08-18T00:58:13.5459306Z         PASS [   0.039s] ( 375/2564) spt::bin/spt helpfmt::tests::link_becomes_its_text
2026-08-18T00:58:13.5504053Z         PASS [   0.039s] ( 376/2564) spt::bin/spt helpfmt::tests::marker_never_spans_a_hard_break
2026-08-18T00:58:13.5559492Z         PASS [   0.042s] ( 377/2564) spt::bin/spt helpfmt::tests::marker_spans_a_clap_soft_wrap
2026-08-18T00:58:13.5617164Z         PASS [   0.042s] ( 378/2564) spt::bin/spt helpfmt::tests::multibyte_text_survives
2026-08-18T00:58:13.5652985Z         PASS [   0.041s] ( 379/2564) spt::bin/spt helpfmt::tests::nested_code_inside_bold_styles_both
2026-08-18T00:58:13.5692192Z         PASS [   0.041s] ( 380/2564) spt::bin/spt helpfmt::tests::plain_text_is_unchanged
2026-08-18T00:58:13.5737202Z         PASS [   0.040s] ( 381/2564) spt::bin/spt helpfmt::tests::preexisting_ansi_is_passed_through_untouched
2026-08-18T00:58:13.5787439Z         PASS [   0.039s] ( 382/2564) spt::bin/spt helpfmt::tests::resolve_console_color_strips_when_vt_unavailable
2026-08-18T00:58:13.5845859Z         PASS [   0.039s] ( 383/2564) spt::bin/spt monicverb::tests::add_refuses_to_replace_and_update_refuses_to_invent
2026-08-18T00:58:13.5874997Z         PASS [   0.037s] ( 384/2564) spt::bin/spt monicverb::tests::no_monic_verb_is_elevation_gated
2026-08-18T00:58:13.6373102Z         PASS [   0.081s] ( 385/2564) spt::bin/spt picker::data::tests::disambiguate_project_ids_cases
2026-08-18T00:58:13.6419319Z         PASS [   0.080s] ( 386/2564) spt::bin/spt picker::data::tests::driven_by_display_renders_name_not_hex
2026-08-18T00:58:13.6638459Z         PASS [   0.084s] ( 387/2564) spt::bin/spt picker::data::tests::indexed_projection_full_w2shaped_and_absent_legs
2026-08-18T00:58:13.6749232Z         PASS [   0.089s] ( 388/2564) spt::bin/spt picker::data::tests::non_drivable_predicate_covers_worker_and_psyche
2026-08-18T00:58:13.7025754Z         PASS [   0.060s] ( 389/2564) spt::bin/spt picker::data::tests::project_refs_from_sessions_excludes_owlery_and_dedups_newest_first
2026-08-18T00:58:13.7093928Z         PASS [   0.041s] ( 390/2564) spt::bin/spt picker::data::tests::project_refs_from_unions_fresh_origin_and_store_branches
2026-08-18T00:58:13.7121408Z         PASS [   0.118s] ( 391/2564) spt::bin/spt picker::data::tests::own_node_tab_label_falls_back_to_keyprefix
2026-08-18T00:58:13.7244568Z         PASS [   0.046s] ( 392/2564) spt::bin/spt picker::data::tests::reconcile_overrides_subnet_with_local_roster
2026-08-18T00:58:13.7360317Z         PASS [   0.030s] ( 393/2564) spt::bin/spt picker::data::tests::resume_rows_derive_per_row_project_and_drop_owlery_sessions
2026-08-18T00:58:13.7721366Z         PASS [   0.070s] ( 394/2564) spt::bin/spt picker::data::tests::remote_picker_renders_suspended_dead_perch_offline
2026-08-18T00:58:13.7722506Z         PASS [   0.068s] ( 395/2564) spt::bin/spt picker::data::tests::remote_rows_render_full_palette_parity
2026-08-18T00:58:13.7928431Z         PASS [   0.223s] ( 396/2564) spt::bin/spt picker::data::tests::gather_renders_live_unbound
2026-08-18T00:58:13.8074511Z         PASS [   0.241s] ( 397/2564) spt::bin/spt picker::data::tests::gather_endpoints_projects_from_seeded_index_with_zero_git
2026-08-18T00:58:13.8118191Z         PASS [   0.075s] ( 398/2564) spt::bin/spt picker::data::tests::row_status_drives_unbound_display
2026-08-18T00:58:13.8263647Z         PASS [   0.105s] ( 399/2564) spt::bin/spt picker::data::tests::resume_rows_title_from_index_cwd_map_with_pure_fallback
2026-08-18T00:58:13.8264436Z         PASS [   0.189s] ( 400/2564) spt::bin/spt picker::data::tests::picker_excludes_flat_worker_and_psyche
2026-08-18T00:58:13.8271205Z         PASS [   0.055s] ( 401/2564) spt::bin/spt picker::model::tests::adapter_tree_nests_profiles
2026-08-18T00:58:13.8342802Z         PASS [   0.041s] ( 402/2564) spt::bin/spt picker::model::tests::back_unwinds
2026-08-18T00:58:13.8371289Z         PASS [   0.030s] ( 403/2564) spt::bin/spt picker::model::tests::build_project_choices_head_here_rest
2026-08-18T00:58:13.8429248Z         PASS [   0.032s] ( 404/2564) spt::bin/spt picker::model::tests::category_labels_render_display_forms
2026-08-18T00:58:13.8450326Z         PASS [   0.073s] ( 405/2564) spt::bin/spt picker::data::tests::shared_machine_is_one_group_with_unioned_subnets
2026-08-18T00:58:13.8486053Z         PASS [   0.023s] ( 406/2564) spt::bin/spt picker::model::tests::category_ring_wraps
2026-08-18T00:58:13.8573618Z         PASS [   0.029s] ( 407/2564) spt::bin/spt picker::model::tests::change_adapter_picks_and_returns_to_confirm
2026-08-18T00:58:13.8624454Z         PASS [   0.035s] ( 408/2564) spt::bin/spt picker::model::tests::choose_project_outcome_bakes_cwd_and_diverts
2026-08-18T00:58:13.8662561Z         PASS [   0.033s] ( 409/2564) spt::bin/spt picker::model::tests::confirm_local_offline_unchanged_by_wake_split
2026-08-18T00:58:13.8696554Z         PASS [   0.033s] ( 410/2564) spt::bin/spt picker::model::tests::confirm_options_remote_suspended_is_wake_not_start
2026-08-18T00:58:13.9176755Z         PASS [   0.075s] ( 411/2564) spt::bin/spt picker::model::tests::confirm_options_status_dependent
2026-08-18T00:58:13.9229711Z         PASS [   0.078s] ( 412/2564) spt::bin/spt picker::model::tests::confirm_terminal_routes
2026-08-18T00:58:13.9295684Z         PASS [   0.081s] ( 413/2564) spt::bin/spt picker::model::tests::confirm_terminal_wake_carries_raw_node
2026-08-18T00:58:13.9353029Z         PASS [   0.080s] ( 414/2564) spt::bin/spt picker::model::tests::create_new_multisubnet_inserts_home_layer
2026-08-18T00:58:13.9431428Z         PASS [   0.079s] ( 415/2564) spt::bin/spt picker::model::tests::create_outcome_bakes_run
2026-08-18T00:58:13.9518884Z         PASS [   0.086s] ( 416/2564) spt::bin/spt picker::model::tests::cursor_clamps
2026-08-18T00:58:13.9545941Z         PASS [   0.381s] ( 417/2564) spt::bin/spt picker::data::tests::home_subnet_options_is_mru_ordered
2026-08-18T00:58:13.9561960Z         PASS [   0.086s] ( 418/2564) spt::bin/spt picker::model::tests::display_mapping_matrix
2026-08-18T00:58:13.9620952Z         PASS [   0.044s] ( 419/2564) spt::bin/spt picker::model::tests::display_status_four_state_type_gated
2026-08-18T00:58:13.9667822Z         PASS [   0.044s] ( 420/2564) spt::bin/spt picker::model::tests::display_status_unbound_is_hollow_and_attachable
2026-08-18T00:58:13.9716749Z         PASS [   0.042s] ( 421/2564) spt::bin/spt picker::model::tests::empty_scope_opens_create
2026-08-18T00:58:13.9768097Z         PASS [   0.042s] ( 422/2564) spt::bin/spt picker::model::tests::ep_display_glyph_and_square_palette
2026-08-18T00:58:13.9816230Z         PASS [   0.040s] ( 423/2564) spt::bin/spt picker::model::tests::esc_backs_out_of_home_layer
2026-08-18T00:58:13.9880467Z         PASS [   0.036s] ( 424/2564) spt::bin/spt picker::model::tests::filter_narrows
2026-08-18T00:58:13.9925617Z         PASS [   0.038s] ( 425/2564) spt::bin/spt picker::model::tests::from_resource_row_maps_gossiped_adapter_projects_controlled
2026-08-18T00:58:14.0424469Z         PASS [   0.086s] ( 426/2564) spt::bin/spt picker::model::tests::home_selection_bakes_into_run_subnet
2026-08-18T00:58:14.0476995Z         PASS [   0.086s] ( 427/2564) spt::bin/spt picker::model::tests::kind_routes
2026-08-18T00:58:14.0533646Z         PASS [   0.086s] ( 428/2564) spt::bin/spt picker::model::tests::launch_keys_live_only_on_launch_capable_highlights
2026-08-18T00:58:14.0588761Z         PASS [   0.087s] ( 429/2564) spt::bin/spt picker::model::tests::prefill_jumps_to_create
2026-08-18T00:58:14.0640632Z         PASS [   0.087s] ( 430/2564) spt::bin/spt picker::model::tests::project_filter_keys_on_slug_while_tab_renders_display
2026-08-18T00:58:14.0698138Z         PASS [   0.088s] ( 431/2564) spt::bin/spt picker::model::tests::purge_confirm_yields_outcome_and_backs_out
2026-08-18T00:58:14.0739598Z         PASS [   0.086s] ( 432/2564) spt::bin/spt picker::model::tests::purge_shortcut_gates_to_offline_local
2026-08-18T00:58:14.0805025Z         PASS [   0.088s] ( 433/2564) spt::bin/spt picker::model::tests::reenter_create_keeps_or_clears_id
2026-08-18T00:58:14.0853193Z         PASS [   0.043s] ( 434/2564) spt::bin/spt picker::model::tests::remove_endpoint_drops_row_and_clamps_cursor
2026-08-18T00:58:14.0906757Z         PASS [   0.043s] ( 435/2564) spt::bin/spt picker::model::tests::resume_outcome_adapter_follows_recorded_row
2026-08-18T00:58:14.1413620Z         PASS [   0.088s] ( 436/2564) spt::bin/spt picker::model::tests::resume_outcome_bakes_session
2026-08-18T00:58:14.1468247Z         PASS [   0.088s] ( 437/2564) spt::bin/spt picker::model::tests::resume_title_render
2026-08-18T00:58:14.1515571Z         PASS [   0.087s] ( 438/2564) spt::bin/spt picker::model::tests::should_offer_project_choice_fire_conditions
2026-08-18T00:58:14.1568182Z         PASS [   0.087s] ( 439/2564) spt::bin/spt picker::model::tests::single_subnet_skips_home_layer
2026-08-18T00:58:14.1616370Z         PASS [   0.088s] ( 440/2564) spt::bin/spt picker::model::tests::suspended_is_distinct_from_offline
2026-08-18T00:58:14.1665653Z         PASS [   0.086s] ( 441/2564) spt::bin/spt picker::model::tests::the_picker_refuses_the_reserved_id_as_it_is_typed
2026-08-18T00:58:14.1728085Z         PASS [   0.088s] ( 442/2564) spt::bin/spt picker::model::tests::visible_partitions_and_sorts
2026-08-18T00:58:14.1775408Z         PASS [   0.087s] ( 443/2564) spt::bin/spt picker::shortcut::tests::basename_is_parameterized
2026-08-18T00:58:14.1823364Z         PASS [   0.041s] ( 444/2564) spt::bin/spt picker::shortcut::tests::sentinel_detection_spans_both_generations
2026-08-18T00:58:14.1874593Z         PASS [   0.041s] ( 445/2564) spt::bin/spt picker::shortcut::tests::the_body_is_the_ladder_verb
2026-08-18T00:58:14.1972854Z         PASS [   0.040s] ( 446/2564) spt::bin/spt picker::tests::backspace_backs_out_screens_like_esc
2026-08-18T00:58:14.2033416Z         PASS [   0.042s] ( 447/2564) spt::bin/spt picker::tests::backspace_stays_char_delete_in_text_contexts
2026-08-18T00:58:14.2079381Z         PASS [   0.041s] ( 448/2564) spt::bin/spt picker::tests::purge_outcomes_convert_to_flash_lines
2026-08-18T00:58:14.2170614Z         PASS [   0.044s] ( 449/2564) spt::bin/spt picker::tests::purge_transition_reconstructs_the_complete_screen_after_external_mutation
2026-08-18T00:58:14.2214452Z         PASS [   0.070s] ( 450/2564) spt::bin/spt picker::shortcut::tests::write_create_update_regenerate_refuse
2026-08-18T00:58:14.2682008Z         PASS [   0.090s] ( 451/2564) spt::bin/spt picker::view::tests::adapter_tree_buffer
2026-08-18T00:58:14.2762876Z         PASS [   0.094s] ( 452/2564) spt::bin/spt picker::view::tests::change_adapter_screen_renders_tree_and_apply_legend
2026-08-18T00:58:14.2810179Z         PASS [   0.093s] ( 453/2564) spt::bin/spt picker::view::tests::choose_project_buffer_keeps_confirm_panel
2026-08-18T00:58:14.2919284Z         PASS [   0.088s] ( 454/2564) spt::bin/spt picker::view::tests::confirm_fork_and_shortcut_labels_are_dir_relative
2026-08-18T00:58:14.2943520Z         PASS [   0.097s] ( 455/2564) spt::bin/spt picker::view::tests::confirm_buffer_options
2026-08-18T00:58:14.2994673Z         PASS [   0.082s] ( 456/2564) spt::bin/spt picker::view::tests::create_home_lists_subnets
2026-08-18T00:58:14.3032868Z         PASS [   0.095s] ( 457/2564) spt::bin/spt picker::view::tests::confirm_panel_history_renders_display_not_slug
2026-08-18T00:58:14.3084955Z         PASS [   0.087s] ( 458/2564) spt::bin/spt picker::view::tests::every_picker_list_view_keeps_its_caret_on_screen
2026-08-18T00:58:14.3159132Z         PASS [   0.040s] ( 459/2564) spt::bin/spt picker::view::tests::kind_buffer
2026-08-18T00:58:14.3235028Z         PASS [   0.042s] ( 460/2564) spt::bin/spt picker::view::tests::pick_buffer_has_squares_and_description
2026-08-18T00:58:14.3285809Z         PASS [   0.037s] ( 461/2564) spt::bin/spt picker::view::tests::pick_empty_category_hint
2026-08-18T00:58:14.3313380Z         PASS [   0.063s] ( 462/2564) spt::bin/spt picker::view::tests::footer_hints_h_s_only_when_launch_keys_live
2026-08-18T00:58:14.3390113Z         PASS [   0.039s] ( 463/2564) spt::bin/spt picker::view::tests::resume_buffer_keeps_confirm_panel
2026-08-18T00:58:14.3429727Z         PASS [   0.040s] ( 464/2564) spt::bin/spt picker::view::tests::resume_buffer_lists_sessions
2026-08-18T00:58:14.3477169Z         PASS [   0.039s] ( 465/2564) spt::bin/spt picker::view::tests::the_caret_row_accounts_for_the_group_headers_above_it
2026-08-18T00:58:14.3529299Z         PASS [   0.029s] ( 466/2564) spt::bin/spt rc::tests::a_bringable_target_reaches_bring_up_with_the_offline_row_present
2026-08-18T00:58:14.3587436Z         PASS [   0.030s] ( 467/2564) spt::bin/spt rc::tests::a_refusal_names_the_targets_own_entry_surface
2026-08-18T00:58:14.3596663Z         PASS [   0.044s] ( 468/2564) spt::bin/spt picker::view::tests::the_caret_stays_on_screen_when_the_list_outruns_the_viewport
2026-08-18T00:58:14.3784859Z         PASS [   0.084s] ( 469/2564) spt::bin/spt picker::view::tests::pick_status_line_four_state
2026-08-18T00:58:14.3843503Z         PASS [   0.053s] ( 470/2564) spt::bin/spt rc::tests::attach_against_stopped_daemon_never_spawns_and_exits_loud
2026-08-18T00:58:14.4138712Z         PASS [   0.075s] ( 471/2564) spt::bin/spt rc::tests::attach_gate_routes_on_session_truth_not_the_row
2026-08-18T00:58:14.4240109Z         PASS [   0.076s] ( 472/2564) spt::bin/spt rc::tests::bracketed_paste_framing_is_exact_and_content_verbatim
2026-08-18T00:58:14.4292611Z         PASS [   0.076s] ( 473/2564) spt::bin/spt rc::tests::bringable_is_the_engine_room_addressed_plainly_with_a_code
2026-08-18T00:58:14.4339763Z         PASS [   0.075s] ( 474/2564) spt::bin/spt rc::tests::bringup_prompt_names_the_node_and_the_home_subnet
2026-08-18T00:58:14.4389794Z         PASS [   0.079s] ( 475/2564) spt::bin/spt rc::tests::canonical_wire_id_strips_qualifiers_to_the_bare_id
2026-08-18T00:58:14.4445567Z         PASS [   0.066s] ( 476/2564) spt::bin/spt rc::tests::classify_read_err_eof_is_graceful_not_fatal
2026-08-18T00:58:14.4482929Z         PASS [   0.064s] ( 477/2564) spt::bin/spt rc::tests::clipboard_paste_wraps_nonempty_and_noops_on_empty_or_failure
2026-08-18T00:58:14.4546525Z         PASS [   0.041s] ( 478/2564) spt::bin/spt rc::tests::detach_keybind_semantics
2026-08-18T00:58:14.4600437Z         PASS [   0.036s] ( 479/2564) spt::bin/spt rc::tests::detach_prefix_spans_chunks
2026-08-18T00:58:14.4626618Z         PASS [   0.120s] ( 480/2564) spt::bin/spt rc::tests::attach_offline_endpoint_short_circuits_clean
2026-08-18T00:58:14.4650975Z         PASS [   0.036s] ( 481/2564) spt::bin/spt rc::tests::display_guard_postlude_exactly_once_and_inactive_silent
2026-08-18T00:58:14.4691421Z         PASS [   0.035s] ( 482/2564) spt::bin/spt rc::tests::driver_phrase_names_own_node_plainly_but_remote_verbatim
2026-08-18T00:58:14.4782242Z         PASS [   0.034s] ( 483/2564) spt::bin/spt rc::tests::first_event_stall_decision
2026-08-18T00:58:14.4826364Z         PASS [   0.034s] ( 484/2564) spt::bin/spt rc::tests::fold_code_key_prompt_rules
2026-08-18T00:58:14.4872262Z         PASS [   0.032s] ( 485/2564) spt::bin/spt rc::tests::give_up_copy_names_daemon_down_vs_generic
2026-08-18T00:58:14.4920596Z         PASS [   0.032s] ( 486/2564) spt::bin/spt rc::tests::harness_only_row_matches_online_seatless_live_agents_only
2026-08-18T00:58:14.4958778Z         PASS [   0.033s] ( 487/2564) spt::bin/spt rc::tests::identity_line_format
2026-08-18T00:58:14.5006661Z         PASS [   0.036s] ( 488/2564) spt::bin/spt rc::tests::key_event_step_detach_sm
2026-08-18T00:58:14.5048036Z         PASS [   0.036s] ( 489/2564) spt::bin/spt rc::tests::mouse_is_paste_only_right_button_down
2026-08-18T00:58:14.5091057Z         PASS [   0.031s] ( 490/2564) spt::bin/spt rc::tests::mouse_mode_decset_scan_survives_split_across_chunks
2026-08-18T00:58:14.5587120Z         PASS [   0.076s] ( 491/2564) spt::bin/spt rc::tests::mouse_mode_decset_scan_tracks_enable_and_sgr
2026-08-18T00:58:14.5655361Z         PASS [   0.078s] ( 492/2564) spt::bin/spt rc::tests::op_minter_distinct_and_monotonic
2026-08-18T00:58:14.5724917Z         PASS [   0.080s] ( 493/2564) spt::bin/spt rc::tests::pre_broker_busy_guidance_fires_for_any_driver_not_just_remote
2026-08-18T00:58:14.5771924Z         PASS [   0.081s] ( 494/2564) spt::bin/spt rc::tests::public_attach_failure_maps_deadline_class_only
2026-08-18T00:58:14.5825831Z         PASS [   0.082s] ( 495/2564) spt::bin/spt rc::tests::pump_status_emit_sequence_over_write_sink
2026-08-18T00:58:14.5868603Z         PASS [   0.082s] ( 496/2564) spt::bin/spt rc::tests::reassert_scanner_survives_split_across_chunks
2026-08-18T00:58:14.5921912Z         PASS [   0.083s] ( 497/2564) spt::bin/spt rc::tests::reassert_scanner_triggers_only_on_region_destroyers
2026-08-18T00:58:14.5961776Z         PASS [   0.038s] ( 498/2564) spt::bin/spt rc::tests::reconnect_banner_clears_and_centers
2026-08-18T00:58:14.6009815Z         PASS [   0.035s] ( 499/2564) spt::bin/spt rc::tests::reconnect_banner_shows_the_countdown
2026-08-18T00:58:14.6054592Z         PASS [   0.033s] ( 500/2564) spt::bin/spt rc::tests::reconnect_remaining_secs_counts_down_ceil
2026-08-18T00:58:14.6115564Z         PASS [   0.034s] ( 501/2564) spt::bin/spt rc::tests::reconnect_window_expiry_decision
2026-08-18T00:58:14.6161082Z         PASS [   0.033s] ( 502/2564) spt::bin/spt rc::tests::scroll_dir_classifies_wheel_only
2026-08-18T00:58:14.6222377Z         PASS [   0.035s] ( 503/2564) spt::bin/spt rc::tests::scroll_sgr_emits_exact_xterm_bytes
2026-08-18T00:58:14.6275391Z         PASS [   0.035s] ( 504/2564) spt::bin/spt rc::tests::serve_eof_severed_vs_refused
2026-08-18T00:58:14.6276341Z         PASS [   0.189s] ( 505/2564) spt::bin/spt rc::tests::establish_attach_reuses_the_probes_carried_pump_conn
2026-08-18T00:58:14.6326026Z         PASS [   0.036s] ( 506/2564) spt::bin/spt rc::tests::status_assert_reserves_row1_then_repaints
2026-08-18T00:58:14.6374184Z         PASS [   0.036s] ( 507/2564) spt::bin/spt rc::tests::status_repaint_exact_bytes_and_right_align
2026-08-18T00:58:14.6425091Z         PASS [   0.037s] ( 508/2564) spt::bin/spt rc::tests::status_restore_exact_bytes
2026-08-18T00:58:14.6465074Z         PASS [   0.035s] ( 509/2564) spt::bin/spt rc::tests::status_row_marker_is_disabled_by_flag
2026-08-18T00:58:14.6514653Z         PASS [   0.035s] ( 510/2564) spt::bin/spt rc::tests::status_update_size_repoints_geometry
2026-08-18T00:58:14.7030321Z         PASS [   0.081s] ( 511/2564) spt::bin/spt rc::tests::teardown_matrix_postlude_precedes_prose_across_every_final_class
2026-08-18T00:58:14.7076501Z         PASS [   0.080s] ( 512/2564) spt::bin/spt rc::tests::the_client_refuses_engine_room_viewports_and_qualified_targets_only
2026-08-18T00:58:14.7130322Z         PASS [   0.085s] ( 513/2564) spt::bin/spt rc::tests::translate_key_event_emits_exact_xterm_vt
2026-08-18T00:58:14.7220909Z         PASS [   0.089s] ( 514/2564) spt::bin/spt rc::tests::with_vt_output_disables_newline_auto_return
2026-08-18T00:58:14.7264374Z         PASS [   0.089s] ( 515/2564) spt::bin/spt rc::tests::with_vt_output_enables_virtual_terminal_processing
2026-08-18T00:58:14.7635106Z         PASS [   0.118s] ( 516/2564) spt::bin/spt roster::tests::detect_self_by_ancestry_none_when_no_ancestor_owns_a_perch
2026-08-18T00:58:14.7690946Z         PASS [   0.118s] ( 517/2564) spt::bin/spt roster::tests::detect_self_id_endpoint_id_leg_is_label_only_and_perch_gated
2026-08-18T00:58:14.7843637Z         PASS [   0.137s] ( 518/2564) spt::bin/spt roster::tests::detect_self_by_ancestry_resolves_a_live_ancestor_perch
2026-08-18T00:58:14.7905173Z         PASS [   1.645s] ( 519/2564) spt::bin/spt cli::tests::the_monic_command_path_treats_a_husk_as_present
2026-08-18T00:58:14.7921577Z         PASS [   0.084s] ( 520/2564) spt::bin/spt roster::tests::detect_self_resolves_spt_hosted_perch_via_parent_pid
2026-08-18T00:58:14.7928533Z         PASS [   0.071s] ( 521/2564) spt::bin/spt roster::tests::enumerate_yields_offline_corrupt_row_for_unparseable_info
2026-08-18T00:58:14.7937389Z         PASS [   0.091s] ( 522/2564) spt::bin/spt roster::tests::detect_self_id_resolves_identity_with_zero_git_spawns
2026-08-18T00:58:14.7960733Z         PASS [   0.036s] ( 523/2564) spt::bin/spt roster::tests::match_self_by_ancestry_disambiguates_and_none
2026-08-18T00:58:14.8190148Z         PASS [   0.035s] ( 524/2564) spt::bin/spt teardown::tests::an_unconfirmed_row_over_a_dead_root_is_stale_not_a_survivor
2026-08-18T00:58:14.8196722Z         PASS [   0.093s] ( 525/2564) spt::bin/spt roster::tests::list_all_perch_dirs_enumerates_nested_psyche_for_self_resolution
2026-08-18T00:58:14.8325530Z         PASS [   0.063s] ( 526/2564) spt::bin/spt roster::tests::parent_pid_candidates_stay_ancestry_gated
2026-08-18T00:58:14.8481296Z         PASS [   0.058s] ( 527/2564) spt::bin/spt teardown::tests::liveness_proof_needs_a_real_snapshot_and_finds_this_process
2026-08-18T00:58:14.8535362Z         PASS [   5.417s] ( 528/2564) spt::bin/spt cli::tests::adapter_translate_proof_gates_on_commit
2026-08-18T00:58:14.8590493Z         PASS [   0.146s] ( 529/2564) spt::bin/spt roster::tests::enumerate_nested_keeps_a_child_whose_name_has_no_kind_suffix
2026-08-18T00:58:14.8763250Z         PASS [   0.085s] ( 530/2564) spt::bin/spt teardown::tests::timeout_refuses_the_stamp_and_names_the_survivor
2026-08-18T00:58:14.8812507Z         PASS [   0.088s] ( 531/2564) spt::bin/spt teardown::tests::topology_gate_is_controllable_true_only
2026-08-18T00:58:14.8861774Z         PASS [   0.092s] ( 532/2564) spt::bin/spt tests::broken_pipe_panic_classifier
2026-08-18T00:58:14.8985938Z         PASS [   0.102s] ( 533/2564) spt::bin/spt tests::the_sized_stack_wrapper_maps_a_panic_to_the_main_thread_code
2026-08-18T00:58:14.9049540Z         PASS [   0.024s] ( 534/2564) spt::bin/spt unlisted::tests::an_exclusion_outranks_the_strongest_evidence
2026-08-18T00:58:14.9052894Z         PASS [   0.086s] ( 535/2564) spt::bin/spt trustwarnverb::tests::showing_the_warning_is_never_elevation_gated
2026-08-18T00:58:14.9102492Z         PASS [   0.078s] ( 536/2564) spt::bin/spt trustwarnverb::tests::the_gate_keys_on_whether_the_verb_writes
2026-08-18T00:58:14.9131977Z         PASS [   0.065s] ( 537/2564) spt::bin/spt trustwarnverb::tests::writing_an_override_requires_confirmed_elevation
2026-08-18T00:58:14.9192704Z         PASS [   0.066s] ( 538/2564) spt::bin/spt unlisted::tests::a_cross_node_knock_says_answer_unknown_while_a_same_node_one_says_approved
2026-08-18T00:58:14.9230649Z         PASS [   0.064s] ( 539/2564) spt::bin/spt unlisted::tests::a_rule_only_row_has_no_node_to_route_to
2026-08-18T00:58:14.9291361Z         PASS [   0.053s] ( 540/2564) spt::bin/spt unlisted::tests::an_exclusion_and_an_unheard_of_id_are_different_refusals
2026-08-18T00:58:14.9327390Z         PASS [   0.114s] ( 541/2564) spt::bin/spt trustwarnverb::tests::a_refusal_names_the_verb_the_endpoint_and_the_reason
2026-08-18T00:58:14.9378042Z         PASS [   0.052s] ( 542/2564) spt::bin/spt unlisted::tests::an_inbound_knock_is_never_read_as_our_own_outbound_act
2026-08-18T00:58:14.9431408Z         PASS [   0.045s] ( 543/2564) spt::bin/spt unlisted::tests::contact_evidence_outside_the_window_produces_no_row
2026-08-18T00:58:14.9482762Z         PASS [   0.043s] ( 544/2564) spt::bin/spt unlisted::tests::listed_local_and_excluded_rows_are_dropped_and_the_rest_survive
2026-08-18T00:58:14.9526619Z         PASS [   0.047s] ( 545/2564) spt::bin/spt unlisted::tests::no_evidence_phrase_claims_liveness
2026-08-18T00:58:15.0075686Z         PASS [   0.097s] ( 546/2564) spt::bin/spt unlisted::tests::no_knock_evidence_phrase_claims_liveness
2026-08-18T00:58:15.0145590Z         PASS [   0.101s] ( 547/2564) spt::bin/spt unlisted::tests::rule_evidence_carries_no_node_and_contact_evidence_does
2026-08-18T00:58:15.0296763Z         PASS [   0.110s] ( 548/2564) spt::bin/spt unlisted::tests::the_relative_stamp_is_coarse_and_has_no_zero_forms
2026-08-18T00:58:15.0297599Z         PASS [   0.106s] ( 549/2564) spt::bin/spt unlisted::tests::the_route_refuses_an_excluded_id_and_admits_a_non_excluded_one
2026-08-18T00:58:15.0382450Z         PASS [   0.109s] ( 550/2564) spt::bin/spt unlisted::tests::the_strongest_provenance_labels_the_row_and_a_weaker_one_supplies_the_node
2026-08-18T00:58:15.0442530Z         PASS [   0.106s] ( 551/2564) spt-daemon access::tests::a_sender_endpoint_rule_does_not_admit_a_fork
2026-08-18T00:58:15.0706534Z         PASS [   0.138s] ( 552/2564) spt-daemon access::tests::a_fork_grant_admits_fork_and_nothing_else_admits_fork
2026-08-18T00:58:15.0735148Z         PASS [   0.130s] ( 553/2564) spt-daemon access::tests::corrupt_store_degrades_closed_but_replies_survive
2026-08-18T00:58:15.0764938Z         PASS [   0.128s] ( 554/2564) spt-daemon access::tests::discover_gate_discloses_per_viewer
2026-08-18T00:58:15.0876853Z         PASS [   0.073s] ( 555/2564) spt-daemon access::tests::gate_feeds_the_proven_sender_endpoint_tier
2026-08-18T00:58:15.0905538Z         PASS [   0.082s] ( 556/2564) spt-daemon access::tests::gate_decision_table
2026-08-18T00:58:15.0910829Z         PASS [   0.138s] ( 557/2564) spt-daemon access::tests::discover_gate_withholds_everything_while_degraded
2026-08-18T00:58:15.0923693Z         PASS [   0.063s] ( 558/2564) spt-daemon access::tests::reply_passes_where_unsolicited_refused
2026-08-18T00:58:15.0963675Z         PASS [   0.052s] ( 559/2564) spt-daemon access::tests::the_decision_helpers_split_pass_from_refusal_for_every_reason
2026-08-18T00:58:15.0981633Z         PASS [   0.068s] ( 560/2564) spt-daemon access::tests::gate_is_per_surface
2026-08-18T00:58:15.1207578Z         PASS [   0.082s] ( 561/2564) spt-daemon access::tests::same_node_always_passes_without_minting
2026-08-18T00:58:15.1604667Z         PASS [   0.083s] ( 562/2564) spt-daemon access::tests::the_inbound_lock_answers_replies_only_and_only_while_controlled
2026-08-18T00:58:15.1815104Z         PASS [   0.086s] ( 563/2564) spt-daemon access::tests::the_knock_exemption_hook_refuses_everything_today
2026-08-18T00:58:15.1817109Z         PASS [   0.106s] ( 564/2564) spt-daemon access::tests::the_engine_room_refuses_even_this_nodes_own_unsolicited_inbound
2026-08-18T00:58:15.1988827Z         PASS [   0.103s] ( 565/2564) spt-daemon access::tests::the_inbound_lock_is_reached_through_the_sender_stamped_entry_point
2026-08-18T00:58:15.2010963Z         PASS [   0.108s] ( 566/2564) spt-daemon access::tests::the_trust_warning_fires_only_for_an_entry_admitted_stranger
2026-08-18T00:58:15.2096877Z         PASS [   0.111s] ( 567/2564) spt-daemon activity::tests::a_state_change_owes_a_push_both_directions
2026-08-18T00:58:15.2106109Z         PASS [   0.140s] ( 568/2564) spt-daemon access::tests::the_engine_room_is_disclosed_only_to_the_viewers_it_chose
2026-08-18T00:58:15.2136605Z         PASS [   0.054s] ( 569/2564) spt-daemon activity::tests::an_identical_observation_pushes_nothing
2026-08-18T00:58:15.2178139Z         PASS [   0.097s] ( 570/2564) spt-daemon activity::tests::a_token_change_with_an_identical_state_owes_a_push
2026-08-18T00:58:15.2222782Z         PASS [   0.126s] ( 571/2564) spt-daemon access::tests::the_wire_origin_stamp_reaches_the_chain
2026-08-18T00:58:15.2255119Z         PASS [   0.046s] ( 572/2564) spt-daemon activity::tests::an_unseen_link_owes_a_push
2026-08-18T00:58:15.2408259Z         PASS [   0.030s] ( 573/2564) spt-daemon activity::tests::remember_forgets_a_vanished_link_so_its_return_re_pushes
2026-08-18T00:58:15.2501115Z         PASS [   0.049s] ( 574/2564) spt-daemon activity::tests::observe_links_on_an_absent_owlery_is_empty
2026-08-18T00:58:16.8887450Z         PASS [   1.797s] ( 575/2564) spt-daemon access::tests::the_pass_reason_names_which_arm_admitted_the_interaction
2026-08-18T00:58:16.8921488Z         PASS [   1.701s] ( 576/2564) spt-daemon activity::tests::an_unstamped_owner_observes_undated_and_stays_silent_across_sweeps
2026-08-18T00:58:16.9418479Z         PASS [   1.726s] ( 577/2564) spt-daemon activity::tests::an_owner_with_no_linked_shell_is_not_observed
2026-08-18T00:58:16.9419373Z         PASS [   1.707s] ( 578/2564) spt-daemon activity::tests::observe_links_sees_only_online_shells_holding_a_token
2026-08-18T00:58:16.9460735Z         PASS [   1.705s] ( 579/2564) spt-daemon activity::tests::the_diff_is_per_link_not_per_owner
2026-08-18T00:58:16.9729602Z         PASS [   1.751s] ( 580/2564) spt-daemon adapter_update::tests::delegated_attested_delegates_command
2026-08-18T00:58:16.9730324Z         PASS [   1.755s] ( 581/2564) spt-daemon activity::tests::the_flip_marker_is_idempotent_to_drop_and_taken_exactly_once
2026-08-18T00:58:16.9741002Z         PASS [   1.749s] ( 582/2564) spt-daemon adapter_update::tests::delegated_unattested_is_skipped
2026-08-18T00:58:16.9803365Z         PASS [   0.088s] ( 583/2564) spt-daemon adapter_update::tests::file_pull_wrong_key_rejected
2026-08-18T00:58:16.9834128Z         PASS [   1.743s] ( 584/2564) spt-daemon adapter_update::tests::file_pull_tampered_bytes_rejected
2026-08-18T00:58:17.0292334Z         PASS [   0.140s] ( 585/2564) spt-daemon adapter_update::tests::file_pull_without_payload_is_skipped
2026-08-18T00:58:17.0306393Z         PASS [   0.129s] ( 586/2564) spt-daemon adapter_update::tests::gh_release_is_managed_cli_side_not_in_pure_plan
2026-08-18T00:58:17.0361394Z         PASS [   1.786s] ( 587/2564) spt-daemon adapter_update::tests::file_pull_verified_against_adapter_key
2026-08-18T00:58:17.0422825Z         PASS [   0.126s] ( 588/2564) spt-daemon adapter_update::tests::ripple_conducts_each_adapter_in_order
2026-08-18T00:58:17.0753411Z         PASS [   0.157s] ( 589/2564) spt-daemon adapter_update::tests::ripple_registered_uses_the_registered_set
2026-08-18T00:58:17.1126313Z         PASS [   0.129s] ( 590/2564) spt-daemon attach::tests::the_engine_room_has_no_viewport_and_takes_its_controls_from_home
2026-08-18T00:58:17.1190584Z         PASS [   0.090s] ( 591/2564) spt-daemon attach::tests::viewer_and_driving_intents_gate_on_different_surfaces
2026-08-18T00:58:17.1195578Z         PASS [   0.139s] ( 592/2564) spt-daemon answerop::tests::an_unknown_outcome_token_acts_on_nothing
2026-08-18T00:58:17.1500490Z         PASS [   0.114s] ( 593/2564) spt-daemon autostart::tests::empty_config_is_a_pure_noop
2026-08-18T00:58:17.1853595Z         PASS [   0.143s] ( 594/2564) spt-daemon autostart::tests::unresolved_adapter_loud_skips_before_any_launch
2026-08-18T00:58:17.1880572Z         PASS [   0.113s] ( 595/2564) spt-daemon brain::tests::a_flagged_sync_frame_baselines_forward_never_backward_on_both_paths
2026-08-18T00:58:17.1881458Z         PASS [   0.075s] ( 596/2564) spt-daemon brain::tests::an_old_broker_wire_without_the_sync_key_keeps_every_legacy_path
2026-08-18T00:58:17.1936806Z         PASS [   0.073s] ( 597/2564) spt-daemon brain::tests::cold_brain_still_rejects_a_forward_output_gap
2026-08-18T00:58:17.1978332Z         PASS [   0.078s] ( 598/2564) spt-daemon brain::tests::controller_resume_from_floor_refetches_after_a_gap
2026-08-18T00:58:17.2045333Z         PASS [   0.054s] ( 599/2564) spt-daemon brain::tests::peer_reply_deadline_caps_below_carrier_deadline
2026-08-18T00:58:17.2094927Z         PASS [   0.024s] ( 600/2564) spt-daemon brain::tests::reclassify_peer_reply_maps_timeout_off_poison
2026-08-18T00:58:17.2206601Z         PASS [   0.033s] ( 601/2564) spt-daemon brain::tests::skip_to_live_accepts_a_forward_seq_jump_via_snap_above
2026-08-18T00:58:17.2227811Z         PASS [   6.902s] ( 602/2564) spt::bin/spt cli::tests::fork_forks_homes_and_deletes_exactly_the_source
2026-08-18T00:58:17.2292347Z         PASS [   0.256s] ( 603/2564) spt-daemon answerop::tests::a_denial_disarms_but_only_when_it_is_proven
2026-08-18T00:58:17.2327761Z         PASS [   0.045s] ( 604/2564) spt-daemon brain::tests::viewer_snap_attach_accepts_a_forward_output_gap
2026-08-18T00:58:17.2514167Z         PASS [   0.277s] ( 605/2564) spt-daemon answerop::tests::a_receipt_from_the_wrong_answerer_or_a_replayed_one_acts_on_nothing
2026-08-18T00:58:17.2617392Z         PASS [   0.286s] ( 606/2564) spt-daemon answerop::tests::a_receipt_fires_only_from_the_node_the_knock_was_sent_to
2026-08-18T00:58:17.3059240Z         PASS [   0.106s] ( 607/2564) spt-daemon brainproc::tests::appended_padding_flips_exe_hash
2026-08-18T00:58:17.3115288Z         PASS [   0.107s] ( 608/2564) spt-daemon brainproc::tests::brain_child_args_carry_generation_and_reason
2026-08-18T00:58:17.3134716Z         PASS [   0.116s] ( 609/2564) spt-daemon brainproc::tests::backoff_doubles_on_fast_death_resets_when_healthy
2026-08-18T00:58:17.3155813Z         PASS [   0.106s] ( 610/2564) spt-daemon brainproc::tests::bytes_gate_truth_table
2026-08-18T00:58:17.3158042Z         PASS [   0.093s] ( 611/2564) spt-daemon brainproc::tests::consumer_gate_spawns_once_when_net_enabled
2026-08-18T00:58:17.3745226Z         PASS [   0.142s] ( 612/2564) spt-daemon brainproc::tests::planned_restart_respawns_with_update_reason
2026-08-18T00:58:17.4028669Z         PASS [   0.091s] ( 613/2564) spt-daemon brainproc::tests::ready_exe_hash_parses_and_is_n1_readable
2026-08-18T00:58:17.4091090Z         PASS [   0.150s] ( 614/2564) spt-daemon brainproc::tests::ready_but_wrong_bytes_rolls_back_never_promotes
2026-08-18T00:58:17.4137420Z         PASS [   0.098s] ( 615/2564) spt-daemon brainproc::tests::ready_generation_parses_stamp_and_fails_safe
2026-08-18T00:58:17.4189536Z         PASS [   0.105s] ( 616/2564) spt-daemon brainproc::tests::ready_generation_at_reads_file_and_absent_is_none
2026-08-18T00:58:17.4649964Z         PASS [   0.090s] ( 617/2564) spt-daemon brainproc::tests::rollback_running_version_is_prior_not_n_minus_one
2026-08-18T00:58:17.4755566Z         PASS [   0.066s] ( 618/2564) spt-daemon brainproc::tests::select_brain_exe_prefers_canonical_over_per_spawn_current_exe
2026-08-18T00:58:17.4795598Z         PASS [   0.077s] ( 619/2564) spt-daemon brainproc::tests::rolled_back_record_spawns_rollback_binary_on_a_fresh_supervisor
2026-08-18T00:58:17.4851043Z         PASS [   0.066s] ( 620/2564) spt-daemon brainproc::tests::start_reason_arg_round_trips_and_is_lenient
2026-08-18T00:58:17.5374413Z         PASS [   8.275s] ( 621/2564) spt::bin/spt cli::tests::a_remote_fork_refuses_delete_source_whole_rather_than_trimming_it
2026-08-18T00:58:17.5512754Z         PASS [   6.416s] ( 622/2564) spt::bin/spt cli::tests::purge_removes_every_record
2026-08-18T00:58:17.5937299Z         PASS [   0.042s] ( 623/2564) spt-daemon codec::tests::back_to_back_frames_decode_independently
2026-08-18T00:58:17.6213736Z         PASS [   0.323s] ( 624/2564) spt-daemon brainproc::tests::ready_candidate_promotes_once_old_gen_drains
2026-08-18T00:58:17.6298810Z         PASS [   0.036s] ( 625/2564) spt-daemon codec::tests::frame_round_trips_through_buffer
2026-08-18T00:58:17.6338984Z         PASS [   0.012s] ( 626/2564) spt-daemon codec::tests::oversized_prefix_rejected
2026-08-18T00:58:17.6496448Z         PASS [   0.020s] ( 627/2564) spt-daemon config::tests::auto_suspend_knob_is_opt_in_default_off
2026-08-18T00:58:17.6594765Z         PASS [   0.024s] ( 628/2564) spt-daemon config::tests::crash_grace_is_config_driven
2026-08-18T00:58:17.6736727Z         PASS [   0.024s] ( 629/2564) spt-daemon config::tests::detached_subnets_knob_defaults_empty
2026-08-18T00:58:17.6776003Z         PASS [   0.362s] ( 630/2564) spt-daemon brainproc::tests::ready_with_matching_bytes_promotes
2026-08-18T00:58:17.6797511Z         PASS [   0.022s] ( 631/2564) spt-daemon config::tests::full_auto_update_is_gated_by_default
2026-08-18T00:58:17.6930412Z         PASS [   0.015s] ( 632/2564) spt-daemon config::tests::missing_file_is_default
2026-08-18T00:58:17.6959990Z         PASS [   0.022s] ( 633/2564) spt-daemon config::tests::malformed_file_degrades_to_default
2026-08-18T00:58:17.7093221Z         PASS [   0.029s] ( 634/2564) spt-daemon config::tests::pulse_period_is_config_driven
2026-08-18T00:58:17.7312879Z         PASS [   0.038s] ( 635/2564) spt-daemon config::tests::relay_choice_is_config_driven
2026-08-18T00:58:17.7489381Z         PASS [   0.053s] ( 636/2564) spt-daemon config::tests::remove_startup_endpoint_takes_one_entry_and_reports_whether_there_was_one
2026-08-18T00:58:17.7654095Z         PASS [   0.280s] ( 637/2564) spt-daemon brainproc::tests::trial_promotes_on_ready_then_supervises_the_accepted_binary
2026-08-18T00:58:17.7846242Z         LEAK [   0.560s] ( 638/2564) spt-daemon brainproc::tests::clear_before_spawn_defeats_exact_generation_stale_file
2026-08-18T00:58:17.7888064Z         PASS [   0.080s] ( 639/2564) spt-daemon config::tests::save_load_roundtrip
2026-08-18T00:58:17.7986284Z         PASS [   0.033s] ( 640/2564) spt-daemon conn::tests::conn_ids_are_unique_and_labels_stay_bounded
2026-08-18T00:58:17.8013900Z         PASS [   0.070s] ( 641/2564) spt-daemon config::tests::startup_endpoints_roundtrip
2026-08-18T00:58:17.8030978Z         PASS [   0.022s] ( 642/2564) spt-daemon conn::tests::organic_write_failure_still_poisons_and_is_not_the_timeout_class
2026-08-18T00:58:17.8113956Z         PASS [   0.022s] ( 643/2564) spt-daemon conn::tests::retirement_token_splits_deadline_from_organic_with_attribution_parity
2026-08-18T00:58:17.8167064Z         PASS [   0.018s] ( 644/2564) spt-daemon consent::tests::decide_honors_full_auto_flag
2026-08-18T00:58:17.8232180Z         PASS [   0.074s] ( 645/2564) spt-daemon config::tests::upsert_startup_endpoint_appends_then_replaces_preserving_other_knobs
2026-08-18T00:58:17.8297903Z         LEAK [   0.578s] ( 646/2564) spt-daemon brainproc::tests::ready_but_old_gen_never_drains_does_not_promote_rolls_back
2026-08-18T00:58:17.8718433Z         PASS [   0.043s] ( 647/2564) spt-daemon crc_swap::tests::apply_rollback_never_strands
2026-08-18T00:58:17.8827781Z         PASS [   0.066s] ( 648/2564) spt-daemon crc_swap::tests::apply_swaps_changed_creates_new_untouched_identical
2026-08-18T00:58:17.8917379Z         PASS [   0.090s] ( 649/2564) spt-daemon consent::tests::no_live_session_resolves_to_none
2026-08-18T00:58:17.8975761Z         PASS [   0.072s] ( 650/2564) spt-daemon crc_swap::tests::crash_recovery_missing_target_keeps_last_good_old
2026-08-18T00:58:17.8983438Z         PASS [   0.068s] ( 651/2564) spt-daemon crc_swap::tests::displace_picks_fresh_old_name_and_gc_sweeps_stale
2026-08-18T00:58:17.9735389Z         PASS [   0.171s] ( 652/2564) spt-daemon consent::tests::resolves_most_recently_active_live_session
2026-08-18T00:58:17.9913966Z         PASS [   0.096s] ( 653/2564) spt-daemon crc_swap::tests::swap_error_carries_op_and_paths
2026-08-18T00:58:17.9957086Z         PASS [   0.113s] ( 654/2564) spt-daemon crc_swap::tests::plan_recurses_nested_dirs
2026-08-18T00:58:17.9961711Z         PASS [   0.105s] ( 655/2564) spt-daemon crc_swap::tests::plan_selects_only_changed
2026-08-18T00:58:18.0309289Z         PASS [   0.566s] ( 656/2564) spt-daemon brainproc::tests::supervisor_owns_generation_and_stamps_start_reason
2026-08-18T00:58:18.0310750Z         PASS [   0.556s] ( 657/2564) spt-daemon brainproc::tests::supervisor_respawns_brain_until_stopped
2026-08-18T00:58:18.0391117Z         PASS [   0.141s] ( 658/2564) spt-daemon daemon::tests::a_captured_spawn_inherits_only_the_handle_in_its_allowlist
2026-08-18T00:58:18.0636658Z         PASS [   0.068s] ( 659/2564) spt-daemon daemon::tests::an_ordinary_teardown_announces_nothing
2026-08-18T00:58:18.0694340Z         PASS [   0.030s] ( 660/2564) spt-daemon daemon::tests::drive_ladder_all_err_returns_last_err
2026-08-18T00:58:18.0701867Z         PASS [   0.097s] ( 661/2564) spt-daemon daemon::tests::a_failed_job_termination_announces_the_tree_loss
2026-08-18T00:58:18.0726411Z         PASS [   0.081s] ( 662/2564) spt-daemon daemon::tests::a_scrubbed_variable_never_reaches_the_child
2026-08-18T00:58:18.0841223Z         PASS [   0.021s] ( 663/2564) spt-daemon daemon::tests::drive_ladder_falls_through_to_next_rung_on_err
2026-08-18T00:58:18.0984171Z         PASS [   0.244s] ( 664/2564) spt-daemon crc_swap::tests::mapped_old_does_not_brick_apply_displaces_aside
2026-08-18T00:58:18.1469913Z         PASS [   0.076s] ( 665/2564) spt-daemon daemon::tests::drive_ladder_picks_first_ok_rung
2026-08-18T00:58:18.1494501Z         PASS [   0.079s] ( 666/2564) spt-daemon daemon::tests::ensure_declines_only_against_a_standing_operator_stop
2026-08-18T00:58:18.1542606Z         LEAK [   0.740s] ( 667/2564) spt-daemon brainproc::tests::stale_generation_minus_one_ready_never_promotes
2026-08-18T00:58:18.1638100Z         PASS [   0.091s] ( 668/2564) spt-daemon daemon::tests::implicit_ensure_declines_without_clearing_the_inhibit
2026-08-18T00:58:18.1659720Z         PASS [   0.067s] ( 669/2564) spt-daemon daemon::tests::launch_ladder_order_is_wmi_schtasks_breakaway_injob
2026-08-18T00:58:18.1741002Z         PASS [   0.083s] ( 670/2564) spt-daemon daemon::tests::is_running_tracks_the_seed_channel
2026-08-18T00:58:18.1741765Z         LEAK [   0.689s] ( 671/2564) spt-daemon brainproc::tests::trial_kills_alive_never_ready_candidate_before_rollback
2026-08-18T00:58:18.1787119Z         PASS [   0.033s] ( 672/2564) spt-daemon daemon::tests::net_retry_backoff_doubles_then_caps
2026-08-18T00:58:18.1968146Z         PASS [   0.033s] ( 673/2564) spt-daemon daemon::tests::null_std_handles_only_on_a_pipe_stderr
2026-08-18T00:58:18.1994253Z         PASS [   0.036s] ( 674/2564) spt-daemon daemon::tests::the_refusal_line_names_the_remedy
2026-08-18T00:58:18.2566727Z         PASS [   0.252s] ( 675/2564) spt-daemon daemon::tests::a_tree_teardown_reaches_a_grandchild_the_service_spawned
2026-08-18T00:58:18.2622254Z         PASS [   0.091s] ( 676/2564) spt-daemon daemon::tests::windows_arg_quoting_roundtrips_the_rules
2026-08-18T00:58:18.2624534Z         PASS [   0.093s] ( 677/2564) spt-daemon daemon::tests::the_tree_loss_line_names_the_loss_not_the_syscall
2026-08-18T00:58:18.2685503Z         PASS [   0.099s] ( 678/2564) spt-daemon daemon::tests::wmi_create_script_carries_the_no_window_startup_spec
2026-08-18T00:58:18.2994280Z         PASS [   0.268s] ( 679/2564) spt-daemon daemon::tests::detached_no_inherit_falls_back_under_a_breakaway_denying_job
2026-08-18T00:58:18.3090375Z         PASS [   0.772s] ( 680/2564) spt-daemon brainproc::tests::trial_rolls_back_after_budget_of_pre_ready_exits
2026-08-18T00:58:18.3173231Z         PASS [   0.139s] ( 681/2564) spt-daemon deadline::tests::advance_after_fire_steps_one_grid_normally_and_collapses_a_stall
2026-08-18T00:58:18.3235257Z         PASS [   0.169s] ( 682/2564) spt-daemon daemon::tests::spawn_env_additions_reach_the_child_and_keep_the_inherited_environment
2026-08-18T00:58:18.3340349Z         PASS [   0.150s] ( 683/2564) spt-daemon deadline::tests::cold_and_crash_write_fresh_anchor_at_now
2026-08-18T00:58:18.3387830Z         PASS [   0.090s] ( 684/2564) spt-daemon deadline::tests::distinct_keys_do_not_cross_clobber
2026-08-18T00:58:18.3410247Z         PASS [   0.142s] ( 685/2564) spt-daemon deadline::tests::corrupt_file_degrades_to_fresh
2026-08-18T00:58:18.3441871Z         PASS [   0.086s] ( 686/2564) spt-daemon deadline::tests::next_fire_between_grid_points_rounds_up
2026-08-18T00:58:18.3484849Z         PASS [   0.089s] ( 687/2564) spt-daemon deadline::tests::next_fire_long_jump_collapses_missed_ticks_to_one
2026-08-18T00:58:18.3511890Z         PASS [   0.082s] ( 688/2564) spt-daemon deadline::tests::next_fire_on_grid_returns_now_and_advances_strictly
2026-08-18T00:58:18.3568043Z         PASS [   0.057s] ( 689/2564) spt-daemon deadline::tests::next_fire_saturates_when_now_precedes_anchor
2026-08-18T00:58:18.3641750Z         PASS [   0.055s] ( 690/2564) spt-daemon deadline::tests::one_shot_fires_at_or_after_target_and_never_resets
2026-08-18T00:58:18.3717449Z         PASS [   0.054s] ( 691/2564) spt-daemon deadline::tests::update_keeps_anchor_and_refreshes_interval
2026-08-18T00:58:18.3756472Z         PASS [   0.052s] ( 692/2564) spt-daemon deadline::tests::update_with_no_file_falls_back_fresh
2026-08-18T00:58:18.4119461Z         PASS [   0.381s] ( 693/2564) spt-daemon daemon::tests::breakaway_spawn_escapes_a_kill_on_close_job
2026-08-18T00:58:18.4250908Z         PASS [   0.092s] ( 694/2564) spt-daemon deadline::tests::zero_interval_degrades_to_config_default
2026-08-18T00:58:18.4294178Z         PASS [   0.091s] ( 695/2564) spt-daemon deelevate::tests::env_overlay_keeps_explicit_spt_home_alive
2026-08-18T00:58:18.4360234Z         PASS [   0.094s] ( 696/2564) spt-daemon deelevate::tests::plan_spawn_deelevates_only_with_a_target
2026-08-18T00:58:18.4421644Z         PASS [   0.098s] ( 697/2564) spt-daemon digest::tests::common_prefix_len_finds_the_unchanged_head
2026-08-18T00:58:18.4558502Z         PASS [   0.099s] ( 698/2564) spt-daemon digest::tests::merge_by_ts_interleaves_context
2026-08-18T00:58:18.4680033Z         PASS [   0.096s] ( 699/2564) spt-daemon digest::tests::projects_empty_for_a_sourceless_endpoint
2026-08-18T00:58:18.4738389Z         PASS [   0.097s] ( 700/2564) spt-daemon digest::tests::resolve_config_precedence
2026-08-18T00:58:18.4787717Z         PASS [   0.066s] ( 701/2564) spt-daemon digest::tests::supersede_collapses_cross_generation_replay_to_newest
2026-08-18T00:58:18.4796237Z         PASS [   0.129s] ( 702/2564) spt-daemon digest::tests::log_less_two_origin_merge_interleaves_by_ts
2026-08-18T00:58:18.4864020Z         PASS [   0.061s] ( 703/2564) spt-daemon digest::tests::supersede_is_noop_on_disjoint_sessions
2026-08-18T00:58:18.4872041Z         PASS [   0.123s] ( 704/2564) spt-daemon digest::tests::projects_a_log_less_endpoint_from_digest_log
2026-08-18T00:58:18.4897854Z         PASS [   0.060s] ( 705/2564) spt-daemon digest::tests::supersede_keeps_within_generation_repeats
2026-08-18T00:58:18.4935083Z         PASS [   0.058s] ( 706/2564) spt-daemon digest::tests::supersede_trims_divider_around_emptied_middle_generation
2026-08-18T00:58:18.5658672Z         PASS [   0.113s] ( 707/2564) spt-daemon digesthub::tests::dropped_subscriber_is_pruned
2026-08-18T00:58:18.5823674Z         PASS [   0.109s] ( 708/2564) spt-daemon digesthub::tests::render_is_glanceable
2026-08-18T00:58:18.5824294Z         PASS [   0.126s] ( 709/2564) spt-daemon digesthub::tests::project_and_publish_stores_latest
2026-08-18T00:58:18.5831778Z         PASS [   0.115s] ( 710/2564) spt-daemon digesthub::tests::publish_delta_is_tail_then_full_refresh
2026-08-18T00:58:18.5848435Z         PASS [   0.107s] ( 711/2564) spt-daemon digesthub::tests::subscribe_returns_current_base
2026-08-18T00:58:18.5851319Z         PASS [   0.106s] ( 712/2564) spt-daemon dispatch::tests::a_fork_record_is_never_read_as_a_message_and_an_old_daemon_drops_it
2026-08-18T00:58:18.6324305Z         PASS [   0.146s] ( 713/2564) spt-daemon dispatch::tests::a_knock_record_routes_here_and_drops_cleanly_on_an_n1_daemon
2026-08-18T00:58:18.6383890Z         PASS [   0.151s] ( 714/2564) spt-daemon dispatch::tests::a_presence_record_classifies_as_its_own_family_and_never_as_a_message
2026-08-18T00:58:18.6426244Z         PASS [   0.153s] ( 715/2564) spt-daemon dispatch::tests::a_receipt_is_never_read_as_a_message_and_never_as_a_knock
2026-08-18T00:58:18.6463005Z         PASS [   0.153s] ( 716/2564) spt-daemon dispatch::tests::a_redemption_is_dropped_by_an_old_daemon_where_a_knock_field_would_have_been_accepted
2026-08-18T00:58:18.6487865Z         PASS [   1.618s] ( 717/2564) spt-daemon autostart::tests::a_persisted_reserved_id_default_is_never_replayed
2026-08-18T00:58:18.6599287Z         PASS [   0.078s] ( 718/2564) spt-daemon dispatch::tests::breaker_trips_with_doubling_capped_window_and_resets_on_progress
2026-08-18T00:58:18.6646368Z         PASS [   0.081s] ( 719/2564) spt-daemon dispatch::tests::classifies_every_family_by_first_line_shape
2026-08-18T00:58:18.6690563Z         PASS [   0.084s] ( 720/2564) spt-daemon dispatch::tests::classify_failure_seat_blocked_is_exactly_the_three_discipline_strings
2026-08-18T00:58:18.6741296Z         PASS [   0.089s] ( 721/2564) spt-daemon dispatch::tests::cold_enumeration_claims_at_most_the_pool_bound_per_poll
2026-08-18T00:58:18.6774968Z         PASS [   0.045s] ( 722/2564) spt-daemon dispatch::tests::digest_pull_and_rest_never_read_as_each_other
2026-08-18T00:58:18.6817648Z         PASS [   0.043s] ( 723/2564) spt-daemon dispatch::tests::dispatch_event_carries_the_complete_key_set
2026-08-18T00:58:18.6882629Z         PASS [   0.046s] ( 724/2564) spt-daemon dispatch::tests::each_presence_word_has_exactly_one_authority
2026-08-18T00:58:18.6904296Z         PASS [   0.342s] ( 725/2564) spt-daemon digest::tests::extractor_spans_sessions_with_a_boundary_marker
2026-08-18T00:58:18.6918114Z         PASS [   0.046s] ( 726/2564) spt-daemon dispatch::tests::feed_accumulator_commits_per_bound_never_per_chunk
2026-08-18T00:58:18.6942241Z         PASS [   0.045s] ( 727/2564) spt-daemon dispatch::tests::finished_is_terminal_for_attach_only
2026-08-18T00:58:18.6986482Z         PASS [   0.039s] ( 728/2564) spt-daemon dispatch::tests::line_endpoint_resolves_each_family_identity_key
2026-08-18T00:58:18.7036836Z         PASS [   0.039s] ( 729/2564) spt-daemon dispatch::tests::oneway_seatblocked_strikes_out_terminal_while_request_reply_paces_forever
2026-08-18T00:58:18.7076285Z         PASS [   0.039s] ( 730/2564) spt-daemon dispatch::tests::only_the_old_broker_unknown_verb_answer_falls_back_to_the_peek
2026-08-18T00:58:18.7201529Z         PASS [   0.138s] ( 731/2564) spt-daemon dispatch::tests::an_unadmitted_asker_is_refused_at_this_nodes_own_seam
2026-08-18T00:58:18.7568495Z         PASS [   0.083s] ( 732/2564) spt-daemon dispatch::tests::seat_blocked_requeues_budget_free_paced_by_the_breaker_window
2026-08-18T00:58:18.7613822Z         PASS [   0.084s] ( 733/2564) spt-daemon dispatch::tests::the_family_census_is_bijective_with_the_enum
2026-08-18T00:58:18.7653797Z         PASS [   0.084s] ( 734/2564) spt-daemon dispatch::tests::the_family_census_knows_about_the_answer_receipt
2026-08-18T00:58:18.7791777Z         PASS [   0.087s] ( 735/2564) spt-daemon dispatch::tests::transient_failure_requeues_bounded_and_terminal_never_reenters
2026-08-18T00:58:18.7826213Z         PASS [   0.088s] ( 736/2564) spt-daemon dispatch::tests::unknown_shapes_refuse_classification
2026-08-18T00:58:18.7865330Z         PASS [   0.088s] ( 737/2564) spt-daemon docshost::tests::content_types_cover_the_bundle_classes
2026-08-18T00:58:18.7910435Z         PASS [   0.087s] ( 738/2564) spt-daemon docshost::tests::port_resolution_env_config_default
2026-08-18T00:58:18.7956433Z         PASS [   0.088s] ( 739/2564) spt-daemon docshost::tests::sanitizer_admits_pages_and_rejects_escapes
2026-08-18T00:58:18.7990417Z         PASS [   0.079s] ( 740/2564) spt-daemon drivehub::tests::a_following_op_is_served_when_nothing_refused
2026-08-18T00:58:18.8040940Z         PASS [   0.047s] ( 741/2564) spt-daemon drivehub::tests::a_foreign_owlery_is_refused_pre_ack_under_its_own_name
2026-08-18T00:58:18.8073604Z         PASS [   0.046s] ( 742/2564) spt-daemon drivehub::tests::activity_and_drive_never_clobber_each_other
2026-08-18T00:58:18.8114260Z         PASS [   0.046s] ( 743/2564) spt-daemon drivehub::tests::activity_take_is_latest_wins_and_exactly_once
2026-08-18T00:58:18.8159414Z         PASS [   0.037s] ( 744/2564) spt-daemon drivehub::tests::an_unknown_op_hangs_up_instead_of_being_swallowed
2026-08-18T00:58:18.8200892Z         PASS [   0.037s] ( 745/2564) spt-daemon drivehub::tests::clear_evicts_both_classes
2026-08-18T00:58:18.8242598Z         PASS [   0.038s] ( 746/2564) spt-daemon drivehub::tests::clear_evicts_the_slot
2026-08-18T00:58:18.8277015Z         PASS [   0.037s] ( 747/2564) spt-daemon drivehub::tests::dead_generation_activity_frame_is_never_served
2026-08-18T00:58:18.8294547Z         PASS [   0.274s] ( 748/2564) spt-daemon dispatch::tests::a_served_probe_leaves_the_targets_spool_and_inbox_byte_identical
2026-08-18T00:58:18.8347356Z         PASS [   0.039s] ( 749/2564) spt-daemon drivehub::tests::dead_generation_frame_is_never_served
2026-08-18T00:58:18.8407381Z         PASS [   0.152s] ( 750/2564) spt-daemon dispatch::tests::the_receiver_decides_origin_and_flood_not_the_sender
2026-08-18T00:58:18.8417906Z         PASS [   0.043s] ( 751/2564) spt-daemon drivehub::tests::drive_result_activity_key_is_additive_on_the_wire
2026-08-18T00:58:18.8458621Z         PASS [   0.042s] ( 752/2564) spt-daemon drivehub::tests::only_a_pre_ack_refusal_permits_a_second_spawn
2026-08-18T00:58:18.8531044Z         PASS [   0.046s] ( 753/2564) spt-daemon drivehub::tests::slots_are_per_owner
2026-08-18T00:58:18.8568823Z         PASS [   0.045s] ( 754/2564) spt-daemon drivehub::tests::take_is_exactly_once
2026-08-18T00:58:18.9040373Z         PASS [   0.088s] ( 755/2564) spt-daemon drivehub::tests::the_launch_reply_shapes_round_trip
2026-08-18T00:58:18.9123513Z         PASS [   0.088s] ( 756/2564) spt-daemon drivehub::tests::write_is_latest_wins
2026-08-18T00:58:18.9222577Z         PASS [   0.093s] ( 757/2564) spt-daemon effect::tests::apply_once_does_not_hold_the_journal_lock_across_effect
2026-08-18T00:58:18.9375675Z         PASS [   0.092s] ( 758/2564) spt-daemon effect::tests::marker_is_single_source_and_frozen
2026-08-18T00:58:18.9416673Z         PASS [   0.088s] ( 759/2564) spt-daemon effect::tests::minter_tag_round_trips
2026-08-18T00:58:18.9469967Z         PASS [   0.119s] ( 760/2564) spt-daemon effect::tests::applied_set_survives_reopen
2026-08-18T00:58:18.9499167Z         PASS [   0.093s] ( 761/2564) spt-daemon effect::tests::open_creates_missing_parent_dirs
2026-08-18T00:58:18.9666433Z         PASS [   0.029s] ( 762/2564) spt-daemon effect::tests::second_apply_for_same_key_is_deduped
2026-08-18T00:58:18.9738896Z         PASS [   0.027s] ( 763/2564) spt-daemon effect::tests::with_tracing_retry_no_retry_on_success
2026-08-18T00:58:19.0055969Z         PASS [   0.055s] ( 764/2564) spt-daemon effect::tests::with_tracing_retry_passes_through_other_errors
2026-08-18T00:58:19.0064310Z         PASS [   0.084s] ( 765/2564) spt-daemon effect::tests::recover_is_migration_free
2026-08-18T00:58:19.0065245Z         PASS [   0.166s] ( 766/2564) spt-daemon effect::tests::failed_effect_is_not_recorded_applied
2026-08-18T00:58:19.0068198Z         PASS [   0.103s] ( 767/2564) spt-daemon effect::tests::poisoned_journal_lock_still_applies_subsequent_ops
2026-08-18T00:58:19.0070258Z         PASS [   0.065s] ( 768/2564) spt-daemon effect::tests::shellchan_and_rc_same_session_dont_collide
2026-08-18T00:58:19.0071780Z         PASS [   0.095s] ( 769/2564) spt-daemon effect::tests::ptywrite_skips_the_durable_journal_write_while_netsend_persists
2026-08-18T00:58:19.0098769Z         PASS [   0.043s] ( 770/2564) spt-daemon effect::tests::with_tracing_retry_retries_once_on_no_longer_held
2026-08-18T00:58:19.0129030Z         PASS [   0.039s] ( 771/2564) spt-daemon effect::tests::with_tracing_retry_terminal_is_public_language
2026-08-18T00:58:19.0162786Z         PASS [   0.011s] ( 772/2564) spt-daemon failedaddr::tests::a_null_address_records_nothing
2026-08-18T00:58:19.0208129Z         PASS [   0.014s] ( 773/2564) spt-daemon failedaddr::tests::a_successful_dial_clears_the_record
2026-08-18T00:58:19.0253073Z         PASS [   0.019s] ( 774/2564) spt-daemon failedaddr::tests::an_expired_record_stops_matching_and_is_swept
2026-08-18T00:58:19.0292821Z         PASS [   0.022s] ( 775/2564) spt-daemon failedaddr::tests::connecting_to_a_peer_clears_only_that_peers_records
2026-08-18T00:58:19.0334602Z         PASS [   0.026s] ( 776/2564) spt-daemon failedaddr::tests::matches_the_exact_address_and_no_other
2026-08-18T00:58:19.0384539Z         PASS [   0.031s] ( 777/2564) spt-daemon firewall::tests::a_deny_line_naming_the_port_does_not_admit_it
2026-08-18T00:58:19.0428884Z         PASS [   0.033s] ( 778/2564) spt-daemon firewall::tests::a_disabled_manager_does_not_shadow_the_backend
2026-08-18T00:58:19.0474667Z         PASS [   0.035s] ( 779/2564) spt-daemon firewall::tests::a_live_manager_outranks_its_backend
2026-08-18T00:58:19.0525834Z         PASS [   0.036s] ( 780/2564) spt-daemon firewall::tests::active_but_unreadable_is_unverified_not_a_verdict
2026-08-18T00:58:19.0643911Z         PASS [   0.230s] ( 781/2564) spt-daemon effect::tests::each_named_minter_namespaces_its_ops
2026-08-18T00:58:19.0966934Z         PASS [   1.867s] ( 782/2564) spt-daemon brainproc::tests::exe_hash_computed_exactly_once_across_n_publishes
2026-08-18T00:58:19.1020063Z         PASS [   0.260s] ( 783/2564) spt-daemon effect::tests::gauntlet_is_exactly_once_across_brain_crashes
2026-08-18T00:58:19.1027545Z         PASS [   0.082s] ( 784/2564) spt-daemon firewall::tests::active_ufw_is_decided_against_the_bound_port
2026-08-18T00:58:19.1063705Z         PASS [   0.081s] ( 785/2564) spt-daemon firewall::tests::any_rule_of_the_name_admitting_the_binder_passes
2026-08-18T00:58:19.1102072Z         PASS [   0.081s] ( 786/2564) spt-daemon firewall::tests::no_active_firewall_reads_unknown_and_inactive_ones_are_skipped
2026-08-18T00:58:19.1154158Z         PASS [   0.082s] ( 787/2564) spt-daemon firewall::tests::rule_for_another_binary_is_a_mismatch_not_a_pass
2026-08-18T00:58:19.1211381Z         PASS [   0.083s] ( 788/2564) spt-daemon firewall::tests::rule_for_the_binder_passes_regardless_of_case_or_separators
2026-08-18T00:58:19.1265359Z         PASS [   0.084s] ( 789/2564) spt-daemon firewall::tests::unanswerable_probes_read_unknown_and_no_rule_reads_missing
2026-08-18T00:58:19.1320890Z         PASS [   0.085s] ( 790/2564) spt-daemon forkop::tests::forking_into_the_reserved_id_is_refused_before_the_mind_is_copied
2026-08-18T00:58:19.1361099Z         PASS [   0.083s] ( 791/2564) spt-daemon frame::tests::envelope_with_unknown_trailing_field_decodes_on_older_peer
2026-08-18T00:58:19.1405703Z         PASS [   0.076s] ( 792/2564) spt-daemon frame::tests::handshake_accepts_newer_brain_on_older_broker
2026-08-18T00:58:19.1441025Z         PASS [   0.047s] ( 793/2564) spt-daemon frame::tests::handshake_rejects_below_floor
2026-08-18T00:58:19.1487883Z         PASS [   0.047s] ( 794/2564) spt-daemon frame::tests::handshake_rejects_role_mismatch
2026-08-18T00:58:19.1541058Z         PASS [   0.051s] ( 795/2564) spt-daemon frame::tests::unknown_kind_is_not_a_decode_error
2026-08-18T00:58:19.1575946Z         PASS [   0.051s] ( 796/2564) spt-daemon grants::tests::escalation_answers_apply
2026-08-18T00:58:19.1615711Z         PASS [   0.051s] ( 797/2564) spt-daemon grants::tests::escalation_ask_body_roundtrip
2026-08-18T00:58:19.2140265Z         PASS [   0.093s] ( 798/2564) spt-daemon grants::tests::no_session_escalates_with_none_target
2026-08-18T00:58:19.2185973Z         PASS [   0.092s] ( 799/2564) spt-daemon grants::tests::preconsent_flags_author_grants
2026-08-18T00:58:19.2260271Z         PASS [   0.094s] ( 800/2564) spt-daemon grants::tests::reserved_capabilities_refuse_even_when_granted
2026-08-18T00:58:19.2261443Z         PASS [   0.406s] ( 801/2564) spt-daemon drivehub::tests::the_pre_ack_causes_are_three_distinct_diagnostics
2026-08-18T00:58:19.2300077Z         PASS [   0.094s] ( 802/2564) spt-daemon grants::tests::ungranted_escalates_granted_allows
2026-08-18T00:58:19.2338435Z         PASS [   0.093s] ( 803/2564) spt-daemon harnesshost::tests::mint_session_id_is_fresh_hex
2026-08-18T00:58:19.2384113Z         PASS [   0.094s] ( 804/2564) spt-daemon harnesshost::tests::node_key_fills_advertised_label_in_session_template
2026-08-18T00:58:19.2426243Z         PASS [   0.094s] ( 805/2564) spt-daemon harnesshost::tests::node_missing_reference_fails_loud
2026-08-18T00:58:19.2468427Z         PASS [   0.093s] ( 806/2564) spt-daemon harnesshost::tests::prepare_fails_closed_on_wrong_kind_missing_role_and_bad_template
2026-08-18T00:58:19.2519863Z         PASS [   0.094s] ( 807/2564) spt-daemon harnesshost::tests::prepare_fills_env_inject_values_with_substitution
2026-08-18T00:58:19.2575150Z         PASS [   0.096s] ( 808/2564) spt-daemon harnesshost::tests::prepare_fills_id_and_session_into_self_command
2026-08-18T00:58:19.2610036Z         PASS [   0.047s] ( 809/2564) spt-daemon harnesshost::tests::prepare_resume_falls_back_to_self_when_no_resume_role
2026-08-18T00:58:19.2655978Z         PASS [   0.047s] ( 810/2564) spt-daemon harnesshost::tests::prepare_selects_resume_template_on_resume_else_self
2026-08-18T00:58:19.2700170Z         PASS [   0.044s] ( 811/2564) spt-daemon harnesshost::tests::prepare_threads_translation_binary_when_declared
2026-08-18T00:58:19.2734928Z         PASS [   0.047s] ( 812/2564) spt-daemon harnesshost::tests::provisional_session_id_recognizes_own_mint_only
2026-08-18T00:58:19.2785874Z         PASS [   0.049s] ( 813/2564) spt-daemon harnesshost::tests::translation_binary_resolves_against_install_dir
2026-08-18T00:58:19.3774068Z         PASS [   0.135s] ( 814/2564) spt-daemon lifecycle::tests::a_seeded_ingest_fault_survives_a_turn_success_after_a_restart
2026-08-18T00:58:19.4401547Z         PASS [   0.179s] ( 815/2564) spt-daemon lifecycle::tests::base_keys_carries_single_subnet_no_home
2026-08-18T00:58:19.4424723Z         PASS [   0.065s] ( 816/2564) spt-daemon lifecycle::tests::echo_fire_skips_loud_on_relative_dir_without_cwd
2026-08-18T00:58:19.4434211Z         PASS [   0.173s] ( 817/2564) spt-daemon lifecycle::tests::crash_signoff_tears_down_when_still_gone
2026-08-18T00:58:19.4436296Z         PASS [   0.178s] ( 818/2564) spt-daemon lifecycle::tests::crash_signoff_spares_recovered_self
2026-08-18T00:58:19.4663673Z         PASS [   0.209s] ( 819/2564) spt-daemon lifecycle::tests::any_kind_success_clears_timeouts_but_only_its_own_hard_counter
2026-08-18T00:58:19.4754417Z         PASS [   0.202s] ( 820/2564) spt-daemon lifecycle::tests::custody_survives_parent_boundary_and_reseed_clears
2026-08-18T00:58:19.4917667Z         PASS [   0.049s] ( 821/2564) spt-daemon lifecycle::tests::event_turn_bound_follows_the_role_not_the_pulse
2026-08-18T00:58:19.4957734Z         PASS [   0.052s] ( 822/2564) spt-daemon lifecycle::tests::first_turn_psyche_context_is_never_empty
2026-08-18T00:58:19.5018850Z         PASS [   0.255s] ( 823/2564) spt-daemon lifecycle::tests::a_slotless_stamp_seeds_nothing_and_an_unknown_slot_is_ignored
2026-08-18T00:58:19.5110399Z         PASS [   0.036s] ( 824/2564) spt-daemon lifecycle::tests::is_owlery_internal_cases
2026-08-18T00:58:19.5291459Z         PASS [   0.414s] ( 825/2564) spt-daemon grants::tests::escalation_notif_fires_to_most_recent_and_roundtrips
2026-08-18T00:58:19.5300192Z         PASS [   0.251s] ( 826/2564) spt-daemon lifecycle::tests::echo_fire_resolves_relative_commune_dir_against_endpoint_cwd
2026-08-18T00:58:19.5368776Z         PASS [   0.093s] ( 827/2564) spt-daemon lifecycle::tests::harness_owner_gone_anchors_on_parent_pid
2026-08-18T00:58:19.5673267Z         PASS [   0.075s] ( 828/2564) spt-daemon lifecycle::tests::manifest_cell_refresh_swaps_manifest_and_runtime
2026-08-18T00:58:19.5711137Z         PASS [   0.075s] ( 829/2564) spt-daemon lifecycle::tests::node_key_fills_advertised_label_in_lifecycle_base_keys
2026-08-18T00:58:19.5833352Z         PASS [   0.054s] ( 830/2564) spt-daemon lifecycle::tests::outcome_classifies_by_type_never_by_message
2026-08-18T00:58:19.5878001Z         PASS [   0.058s] ( 831/2564) spt-daemon lifecycle::tests::outcome_names_its_leg_and_turn_failure_wins
2026-08-18T00:58:19.5962844Z         PASS [   0.029s] ( 832/2564) spt-daemon lifecycle::tests::psyche_turn_keys_carry_custody_sids_and_context_file_path
2026-08-18T00:58:19.6000396Z         PASS [   0.063s] ( 833/2564) spt-daemon lifecycle::tests::psyche_context_file_continue_is_zero_bytes_fresh_is_nonempty
2026-08-18T00:58:19.6006908Z         PASS [   0.030s] ( 834/2564) spt-daemon lifecycle::tests::psyche_turn_strikes_exhausted_boundary
2026-08-18T00:58:19.6183004Z         PASS [   0.107s] ( 835/2564) spt-daemon lifecycle::tests::orphan_watch_honors_stop_for_live_owner
2026-08-18T00:58:19.6344024Z         PASS [   0.401s] ( 836/2564) spt-daemon inject::tests::has_parked_idle_spool_gates_on_idle_hosted_and_pending
2026-08-18T00:58:19.6348767Z         PASS [   0.168s] ( 837/2564) spt-daemon lifecycle::tests::ingest_hard_failures_stamp_even_while_turns_succeed
2026-08-18T00:58:19.6504102Z         PASS [   0.412s] ( 838/2564) spt-daemon inject::tests::shared_inject_leg_detects_spt_hosted
2026-08-18T00:58:19.6589915Z         PASS [   0.071s] ( 839/2564) spt-daemon lifecycle::tests::pulse_loop_does_not_write_anchor_per_fire
2026-08-18T00:58:19.6967921Z         PASS [   0.100s] ( 840/2564) spt-daemon lifecycle::tests::pulse_loop_is_config_paced_and_killable
2026-08-18T00:58:19.6992499Z         PASS [   0.064s] ( 841/2564) spt-daemon lifecycle::tests::reload_fires_on_disk_change
2026-08-18T00:58:19.7045717Z         PASS [   0.046s] ( 842/2564) spt-daemon lifecycle::tests::reload_noop_when_unchanged
2026-08-18T00:58:19.7123235Z         PASS [   0.062s] ( 843/2564) spt-daemon lifecycle::tests::reload_keeps_last_good_on_unparseable
2026-08-18T00:58:19.7124631Z         PASS [   0.016s] ( 844/2564) spt-daemon lifecycle::tests::reload_noop_without_install_dir
2026-08-18T00:58:19.7136572Z         PASS [   0.212s] ( 845/2564) spt-daemon lifecycle::tests::orphan_watch_fires_on_dead_owner
2026-08-18T00:58:19.7336091Z         PASS [   0.133s] ( 846/2564) spt-daemon lifecycle::tests::pulse_loop_update_preserves_phase_crash_rebases
2026-08-18T00:58:19.7339748Z         PASS [   0.133s] ( 847/2564) spt-daemon lifecycle::tests::pulse_recency_and_auto_suspend_follow_resting_state
2026-08-18T00:58:19.7698310Z         PASS [   0.069s] ( 848/2564) spt-daemon lifecycle::tests::resolve_endpoint_drop_dir_cases
2026-08-18T00:58:19.7906166Z         PASS [   0.077s] ( 849/2564) spt-daemon lifecycle::tests::session_not_found_discriminates_reseed_from_strike
2026-08-18T00:58:19.8209333Z         PASS [   0.238s] ( 850/2564) spt-daemon lifecycle::tests::psyche_turn_threads_parent_read_env_into_spawn
2026-08-18T00:58:19.8781264Z         PASS [   1.188s] ( 851/2564) spt-daemon dispatch::tests::the_relay_observation_is_a_real_connect_and_a_gone_listener_never_reads_offline
2026-08-18T00:58:19.8794378Z         PASS [   0.146s] ( 852/2564) spt-daemon lifecycle::tests::the_expectation_is_recorded_before_the_spawn_not_after
2026-08-18T00:58:19.9457221Z         PASS [   0.241s] ( 853/2564) spt-daemon lifecycle::tests::rest_edge_echo_success_clears_stale_psyche_stamp
2026-08-18T00:58:19.9742802Z         PASS [   0.094s] ( 854/2564) spt-daemon linkhost::tests::force_on_an_offline_instance_is_the_plain_relink
2026-08-18T00:58:20.0045082Z         PASS [   0.214s] ( 855/2564) spt-daemon lifecycle::tests::turn_budget_stamps_on_exhaustion_and_clears_on_success
2026-08-18T00:58:20.0096001Z         PASS [   0.037s] ( 856/2564) spt-daemon linkhost::tests::per_capability_act_gate_blocks_until_class_scoped_grant
2026-08-18T00:58:20.0117326Z         PASS [   0.132s] ( 857/2564) spt-daemon linkhost::tests::force_refuses_an_ephemeral_instance_and_moves_nothing
2026-08-18T00:58:20.1155947Z         PASS [   0.334s] ( 858/2564) spt-daemon lifecycle::tests::timeout_budget_is_ten_deep_not_three
2026-08-18T00:58:20.1861537Z         PASS [   0.452s] ( 859/2564) spt-daemon lifecycle::tests::thrash_budget_trips_on_a_synthetic_failure_loop_without_touching_status
2026-08-18T00:58:20.2206627Z         PASS [   0.399s] ( 860/2564) spt-daemon linkhost::tests::cmd_wakes_a_stale_online_persistent_instance
2026-08-18T00:58:20.2386552Z         PASS [   0.136s] ( 861/2564) spt-daemon linkhost::tests::run_action_honors_the_force_arg
2026-08-18T00:58:20.2534476Z         PASS [   0.242s] ( 862/2564) spt-daemon linkhost::tests::run_action_drive_drops_offline_without_wake_or_spool
2026-08-18T00:58:20.2576729Z         PASS [   0.253s] ( 863/2564) spt-daemon linkhost::tests::prepare_drive_is_live_or_drop_and_never_spools
2026-08-18T00:58:20.2584890Z         PASS [   0.546s] ( 864/2564) spt-daemon lifecycle::tests::role_less_manifest_ticks_strike_free
2026-08-18T00:58:20.2740748Z         PASS [   0.561s] ( 865/2564) spt-daemon lifecycle::tests::rest_event_fires_echo_once_and_wake_resurfaces
2026-08-18T00:58:20.2916038Z         PASS [   0.281s] ( 866/2564) spt-daemon linkhost::tests::relink_refuses_a_live_instance_but_recovers_a_stale_online_one
2026-08-18T00:58:20.2917678Z         PASS [   0.345s] ( 867/2564) spt-daemon linkhost::tests::gateway_typed_owner_resolves_and_drives_keyed_on_id_not_type
2026-08-18T00:58:20.3044205Z         PASS [   0.050s] ( 868/2564) spt-daemon machineid::tests::hash_is_domain_separated_and_stable
2026-08-18T00:58:20.3118775Z         PASS [   0.054s] ( 869/2564) spt-daemon machineid::tests::machine_id_hash_resolves_and_is_stable
2026-08-18T00:58:20.3128223Z         PASS [   0.054s] ( 870/2564) spt-daemon msg::tests::bytes_round_trip_through_payload
2026-08-18T00:58:20.3410802Z         PASS [   0.102s] ( 871/2564) spt-daemon linkhost::tests::survivor_probe_separates_our_binary_from_a_recycled_pid
2026-08-18T00:58:20.3653505Z         PASS [   0.176s] ( 872/2564) spt-daemon linkhost::tests::run_action_refuses_gated_op_without_spooling
2026-08-18T00:58:20.3665126Z         PASS [   0.092s] ( 873/2564) spt-daemon msg::tests::endpoint_injected_envelope_carries_delivered_and_spool_hint
2026-08-18T00:58:20.3723573Z         PASS [   0.082s] ( 874/2564) spt-daemon msg::tests::endpoint_input_frames_round_trip
2026-08-18T00:58:20.3775711Z         PASS [   0.086s] ( 875/2564) spt-daemon msg::tests::evicted_envelope_round_trips
2026-08-18T00:58:20.3808304Z         PASS [   0.076s] ( 876/2564) spt-daemon msg::tests::input_req_absent_ack_defaults_true_n_minus_1_safe
2026-08-18T00:58:20.3867299Z         PASS [   0.075s] ( 877/2564) spt-daemon msg::tests::input_req_ack_false_round_trips_faithfully
2026-08-18T00:58:20.4386790Z         PASS [   0.125s] ( 878/2564) spt-daemon msg::tests::net_frames_round_trip_and_tolerate_unknown_fields
2026-08-18T00:58:20.4441703Z         PASS [   0.103s] ( 879/2564) spt-daemon msg::tests::output_envelope_round_trips
2026-08-18T00:58:20.4943835Z         PASS [   0.131s] ( 880/2564) spt-daemon msg::tests::output_sync_flag_defaults_absent_and_skips_when_false
2026-08-18T00:58:20.4993182Z         PASS [   0.133s] ( 881/2564) spt-daemon msg::tests::presence_event_round_trips_and_tolerates_future_kind
2026-08-18T00:58:20.4998252Z         PASS [   0.279s] ( 882/2564) spt-daemon linkhost::tests::run_action_relinks_drives_and_refuses
2026-08-18T00:58:20.5029973Z         PASS [   0.131s] ( 883/2564) spt-daemon msg::tests::spawn_req_tolerates_unknown_field
2026-08-18T00:58:20.5096426Z         PASS [   0.016s] ( 884/2564) spt-daemon nethost::tests::begin_attach_refuses_only_while_a_poisoned_prior_still_drains
2026-08-18T00:58:20.5130933Z         PASS [   0.133s] ( 885/2564) spt-daemon msg::tests::two_phase_join_wire_round_trips
2026-08-18T00:58:20.5169197Z         PASS [   0.130s] ( 886/2564) spt-daemon msg::tests::wire_decodes_old_shape_to_legacy
2026-08-18T00:58:20.5763225Z         PASS [   0.132s] ( 887/2564) spt-daemon nethost::tests::attach_replay_never_interleaves_with_concurrent_live_appends
2026-08-18T00:58:20.5773484Z         PASS [   0.139s] ( 888/2564) spt-daemon nethost::tests::append_halts_at_first_failed_write_removes_the_seat_and_cancels_the_lease
2026-08-18T00:58:20.5805157Z         PASS [   0.204s] ( 889/2564) spt-daemon msg::tests::stream_lifetime_is_additive_and_defaults_durable
2026-08-18T00:58:20.6137533Z         PASS [   0.104s] ( 890/2564) spt-daemon nethost::tests::displaced_writer_failure_never_cancels_the_successor_lease
2026-08-18T00:58:20.6715148Z         PASS [   0.151s] ( 891/2564) spt-daemon nethost::tests::home_relay_reads_a_real_serialized_endpoint_addr
2026-08-18T00:58:20.6715875Z         PASS [   0.158s] ( 892/2564) spt-daemon nethost::tests::finish_halts_and_removes_a_poisoned_seat
2026-08-18T00:58:20.6719354Z         PASS [   0.169s] ( 893/2564) spt-daemon nethost::tests::dispatch_stream_infos_excludes_local_and_retired_rows_server_side
2026-08-18T00:58:20.6910780Z         PASS [   0.077s] ( 894/2564) spt-daemon nethost::tests::next_seq_counts_appends_not_logical_chunks
2026-08-18T00:58:20.7190847Z         PASS [   0.045s] ( 895/2564) spt-daemon nethost::tests::opener_capture_gives_up_bounded_on_a_newline_less_stream
2026-08-18T00:58:20.7660358Z         PASS [   0.189s] ( 896/2564) spt-daemon nethost::tests::host_binds_endpoint_to_node_identity
2026-08-18T00:58:20.7754196Z         PASS [   0.083s] ( 897/2564) spt-daemon nethost::tests::opener_pins_first_line_across_full_ring_roll
2026-08-18T00:58:20.7768425Z         PASS [   0.105s] ( 898/2564) spt-daemon nethost::tests::open_class_routes_to_the_opener_row_only
2026-08-18T00:58:20.7773277Z         PASS [   0.200s] ( 899/2564) spt-daemon nethost::tests::loopback_conn_is_a_reused_singleton_that_cross_wires_a_stream_pair
2026-08-18T00:58:20.7838253Z         PASS [   0.067s] ( 900/2564) spt-daemon nethost::tests::overflow_detaches_without_lease_cancel_and_the_brain_resumes_from_cursor
2026-08-18T00:58:20.7891108Z         PASS [   0.290s] ( 901/2564) spt-daemon nethost::tests::bounded_block_on_cuts_a_never_completing_op_with_an_ordinary_error
2026-08-18T00:58:20.7894978Z         PASS [   0.122s] ( 902/2564) spt-daemon nethost::tests::op_maps_are_minter_namespaced
2026-08-18T00:58:20.8304759Z         PASS [   0.056s] ( 903/2564) spt-daemon nethost::tests::retentive_log_is_lossless_ordered_while_ordinary_log_overwrites
2026-08-18T00:58:20.8307380Z         PASS [   0.065s] ( 904/2564) spt-daemon nethost::tests::presence_log_mirrors_the_seat_discipline
2026-08-18T00:58:20.9128375Z         PASS [   1.661s] ( 905/2564) spt-daemon lifecycle::tests::an_ingest_consumes_the_standing_expectation
2026-08-18T00:58:20.9630248Z         PASS [   0.185s] ( 906/2564) spt-daemon nethost::tests::retire_sweep_dismisses_the_seat_and_terminal_retire_drops_the_row
2026-08-18T00:58:20.9631786Z         PASS [   0.178s] ( 907/2564) spt-daemon nethost::tests::retired_row_still_flushes_a_late_reply
2026-08-18T00:58:20.9633141Z         PASS [   0.186s] ( 908/2564) spt-daemon nethost::tests::retire_hides_the_row_while_active_rows_stay
2026-08-18T00:58:20.9931075Z         PASS [   0.204s] ( 909/2564) spt-daemon nethost::tests::send_stream_refuses_on_a_canceled_lease
2026-08-18T00:58:20.9939337Z         PASS [   0.163s] ( 910/2564) spt-daemon nethost::tests::unsubscribe_releases_only_the_callers_seat_joins_writer_and_is_idempotent
2026-08-18T00:58:21.0235445Z         PASS [   0.234s] ( 911/2564) spt-daemon nethost::tests::two_hosts_dial_over_loopback
2026-08-18T00:58:21.0531883Z         PASS [   0.553s] ( 912/2564) spt-daemon nethost::tests::conn_close_sweeps_its_stream_rows
2026-08-18T00:58:21.3156597Z         PASS [   0.485s] ( 913/2564) spt-daemon notif::tests::consent_decision_produces_notif_only_when_gated
2026-08-18T00:58:21.3242543Z         PASS [   1.884s] ( 914/2564) spt-daemon lifecycle::tests::empty_sweep_yields_no_outcome_while_a_real_ingest_yields_success
2026-08-18T00:58:21.3276173Z         PASS [   0.415s] ( 915/2564) spt-daemon notif::tests::expired_row_is_auto_dismissed_at_boundary_not_surfaced
2026-08-18T00:58:21.3286292Z         PASS [   1.710s] ( 916/2564) spt-daemon lifecycle::tests::pulse_tick_ingests_drop
2026-08-18T00:58:21.3607876Z         PASS [   0.308s] ( 917/2564) spt-daemon notif::tests::no_live_endpoint_is_a_typed_no_target
2026-08-18T00:58:21.3631189Z         PASS [   0.401s] ( 918/2564) spt-daemon notif::tests::first_fire_declines_an_already_expired_row
2026-08-18T00:58:21.4003171Z         PASS [   0.406s] ( 919/2564) spt-daemon notif::tests::hidden_endpoint_boundary_surfaces_nothing
2026-08-18T00:58:21.4490628Z         PASS [   0.456s] ( 920/2564) spt-daemon notif::tests::first_fire_rides_the_quiet_window_not_the_live_stream
2026-08-18T00:58:21.4678461Z         PASS [   0.143s] ( 921/2564) spt-daemon notif::tests::notif_command_renders_all_keys_and_is_opt_in
2026-08-18T00:58:21.5544467Z         PASS [   0.530s] ( 922/2564) spt-daemon notif::tests::hidden_endpoint_is_never_the_target
2026-08-18T00:58:21.5566085Z         PASS [   0.593s] ( 923/2564) spt-daemon notif::tests::first_fire_redirects_to_a_fresher_remote_winner_unmarked
2026-08-18T00:58:21.5643542Z         PASS [   0.164s] ( 924/2564) spt-daemon notifgate::tests::an_unvalidatable_notify_passes
2026-08-18T00:58:21.5674449Z         PASS [   0.118s] ( 925/2564) spt-daemon notifgate::tests::distinct_notifs_both_deliver
2026-08-18T00:58:21.5800901Z         PASS [   0.618s] ( 926/2564) spt-daemon notif::tests::first_fire_reaches_most_recent_visible_endpoint
2026-08-18T00:58:21.6251697Z         PASS [   0.157s] ( 927/2564) spt-daemon notifgate::tests::retain_preserves_order_of_the_survivors
2026-08-18T00:58:21.6257923Z         PASS [   0.072s] ( 928/2564) spt-daemon notifgate::tests::the_validity_gate_decision_table
2026-08-18T00:58:21.6754104Z         PASS [   0.315s] ( 929/2564) spt-daemon notif::tests::shell_notif_templates_render_for_attached_instances_only
2026-08-18T00:58:21.6985293Z         PASS [   0.073s] ( 930/2564) spt-daemon pairhost::tests::a_re_postured_subnet_advises_and_never_applies
2026-08-18T00:58:21.7226296Z         PASS [   0.407s] ( 931/2564) spt-daemon notif::tests::node_scoped_first_fire_ignores_a_fresher_remote_winner
2026-08-18T00:58:21.7890103Z         PASS [   1.208s] ( 932/2564) spt-daemon nethost::tests::loopback_tunnel_backpressures_without_loss
2026-08-18T00:58:21.7953984Z         PASS [   0.097s] ( 933/2564) spt-daemon pairhost::tests::joiner_clock_render_shows_step_offset_and_state
2026-08-18T00:58:21.8373183Z         PASS [   0.115s] ( 934/2564) spt-daemon pairhost::tests::meet_failure_detail_concise_vs_verbose
2026-08-18T00:58:21.9047612Z         PASS [   0.229s] ( 935/2564) spt-daemon pairhost::tests::an_advisory_records_the_sighting_and_still_applies_nothing
2026-08-18T00:58:21.9251546Z         PASS [   0.361s] ( 936/2564) spt-daemon notifsync::tests::feed_converges_two_stores_and_dismiss_replicates
2026-08-18T00:58:21.9259169Z         PASS [   0.369s] ( 937/2564) spt-daemon notifsync::tests::concurrent_dismiss_and_surface_commute_across_the_feed
2026-08-18T00:58:21.9321723Z         PASS [   0.352s] ( 938/2564) spt-daemon notifsync::tests::non_member_subnet_record_never_materializes
2026-08-18T00:58:21.9327074Z         PASS [   0.144s] ( 939/2564) spt-daemon pairhost::tests::meet_final_retry_failing_surrenders_once
2026-08-18T00:58:21.9635344Z         PASS [   0.396s] ( 940/2564) spt-daemon notifsync::tests::node_scoped_rows_are_excluded_from_the_feed
2026-08-18T00:58:21.9643016Z         PASS [   0.339s] ( 941/2564) spt-daemon notifsync::tests::untrusted_and_cross_subnet_origins_are_dropped
2026-08-18T00:58:21.9706381Z         PASS [   0.175s] ( 942/2564) spt-daemon pairhost::tests::meet_retries_once_after_refresh_on_exhaustion
2026-08-18T00:58:22.0211074Z         PASS [   0.184s] ( 943/2564) spt-daemon pairhost::tests::the_advisory_says_nothing_was_applied
2026-08-18T00:58:22.0258834Z         PASS [   0.698s] ( 944/2564) spt-daemon notif::tests::resurface_delivers_undismissed_with_gates
2026-08-18T00:58:22.0268767Z         PASS [   0.122s] ( 945/2564) spt-daemon pairhost::tests::wire_errors_classify_for_the_guided_ux
2026-08-18T00:58:22.0287826Z         PASS [   0.700s] ( 946/2564) spt-daemon notif::tests::rollback_notif_is_loud_and_resurfaces
2026-08-18T00:58:22.0471157Z         PASS [   0.684s] ( 947/2564) spt-daemon notif::tests::suppression_window_holds_cross_endpoint
2026-08-18T00:58:22.0531468Z         PASS [   0.121s] ( 948/2564) spt-daemon presence::tests::snapshot_loading_degrades_on_junk
2026-08-18T00:58:22.0629673Z         PASS [   0.138s] ( 949/2564) spt-daemon presence::tests::mra_degrades_to_local_and_skips_noise_rows
2026-08-18T00:58:22.0784611Z         PASS [   0.152s] ( 950/2564) spt-daemon presence::tests::mra_joins_local_and_gossiped_legs_under_one_max
2026-08-18T00:58:22.1397664Z         PASS [   0.169s] ( 951/2564) spt-daemon projwriter::tests::corrupt_index_is_repaired_and_counted
2026-08-18T00:58:22.1408859Z         PASS [   0.177s] ( 952/2564) spt-daemon projwriter::tests::cold_construct_spawns_no_git_and_first_cycle_publishes
2026-08-18T00:58:22.1605615Z         PASS [   0.228s] ( 953/2564) spt-daemon presence::tests::subnet_scope_gates_both_legs
2026-08-18T00:58:22.4289877Z         PASS [   0.341s] ( 954/2564) spt-daemon propagate::tests::classifier_maps_every_status_shape
2026-08-18T00:58:22.7153170Z         PASS [   0.689s] ( 955/2564) spt-daemon projwriter::tests::cwd_invalidation_evicts_shared_cache_entry
2026-08-18T00:58:22.7292111Z         PASS [   0.297s] ( 956/2564) spt-daemon psyrelay::tests::null_stdout_driver_fails_the_guard
2026-08-18T00:58:22.7886667Z         PASS [   0.649s] ( 957/2564) spt-daemon psyrelay::tests::empty_and_oversize_bodies_drop_typed
2026-08-18T00:58:22.8293052Z         PASS [   0.658s] ( 958/2564) spt-daemon psyrelay::tests::notify_without_live_endpoint_is_pending
2026-08-18T00:58:22.8697543Z         PASS [   0.729s] ( 959/2564) spt-daemon psyrelay::tests::notify_reaches_own_user_only
2026-08-18T00:58:22.9343614Z         PASS [   0.065s] ( 960/2564) spt-daemon pump::health::tests::a_failing_peer_whose_node_the_registry_reports_offline_reads_absent_not_degraded
2026-08-18T00:58:22.9529708Z         PASS [   0.017s] ( 961/2564) spt-daemon pump::health::tests::a_non_target_connection_never_counts_and_disconnects_mirror_the_conn_set
2026-08-18T00:58:22.9685501Z         PASS [   0.017s] ( 962/2564) spt-daemon pump::health::tests::a_subnet_leave_re_derives_the_live_count_without_disconnecting_anybody
2026-08-18T00:58:22.9811253Z         PASS [   0.013s] ( 963/2564) spt-daemon pump::health::tests::a_target_leaving_the_roster_drops_its_failure_and_can_return_the_node_to_green
2026-08-18T00:58:23.0333523Z         PASS [   0.052s] ( 964/2564) spt-daemon pump::health::tests::degraded_on_all_peer_failure_healthy_only_on_real_progress
2026-08-18T00:58:23.0517447Z         PASS [   0.017s] ( 965/2564) spt-daemon pump::health::tests::five_of_seven_failing_behind_two_live_peers_is_degraded_partial_never_healthy
2026-08-18T00:58:25.2305176Z         PASS [   2.176s] ( 966/2564) spt-daemon pump::health::tests::health_file_roundtrip_and_degrade
2026-08-18T00:58:25.2667234Z         PASS [   0.040s] ( 967/2564) spt-daemon pump::health::tests::one_peer_reconnecting_narrows_the_verdict_without_restarting_the_incident_clock
2026-08-18T00:58:25.3322237Z         PASS [  13.935s] ( 968/2564) spt::bin/spt cli::tests::shell_spawn_gates_on_the_registered_set
2026-08-18T00:58:25.3419016Z         PASS [   0.069s] ( 969/2564) spt-daemon pump::health::tests::one_unaccounted_failing_peer_holds_the_degraded_partial_verdict
2026-08-18T00:58:25.3508006Z         PASS [   0.022s] ( 970/2564) spt-daemon pump::health::tests::peers_absent_replaces_only_a_degraded_verdict_and_never_outlives_its_target
2026-08-18T00:58:25.3643577Z         PASS [   2.576s] ( 971/2564) spt-daemon psyrelay::tests::reply_without_target_is_dropped
2026-08-18T00:58:25.3644324Z         PASS [   0.028s] ( 972/2564) spt-daemon pump::health::tests::registry_admit_stamp_survives_restart_rounds_and_never_regresses
2026-08-18T00:58:25.3652948Z         PASS [   2.655s] ( 973/2564) spt-daemon psyrelay::tests::prose_only_relays_nothing
2026-08-18T00:58:25.4141147Z         PASS [   0.064s] ( 974/2564) spt-daemon pump::health::tests::stage_parses_from_attributed_reasons
2026-08-18T00:58:25.4193862Z         PASS [   0.054s] ( 975/2564) spt-daemon pump::health::tests::stale_gossip_forces_the_conservative_read_even_with_every_node_offline
2026-08-18T00:58:25.4495409Z         PASS [   2.731s] ( 976/2564) spt-daemon psyrelay::tests::reply_relays_to_inbound_sender
2026-08-18T00:58:25.4514711Z         PASS [   0.087s] ( 977/2564) spt-daemon pump::registry::tests::disclosable_lines_keeps_the_per_subnet_filter
2026-08-18T00:58:25.4555647Z         FAIL [   0.038s] ( 978/2564) spt-daemon pump::registry::tests::discover_gate_filters_the_advert_push_per_viewer
2026-08-18T00:58:25.4556454Z   stdout ───
2026-08-18T00:58:25.4556576Z 
2026-08-18T00:58:25.4556661Z     running 1 test
2026-08-18T00:58:25.4557042Z     test pump::registry::tests::discover_gate_filters_the_advert_push_per_viewer ... FAILED
2026-08-18T00:58:25.4557388Z 
2026-08-18T00:58:25.4557462Z     failures:
2026-08-18T00:58:25.4557565Z 
2026-08-18T00:58:25.4557629Z     failures:
2026-08-18T00:58:25.4557905Z         pump::registry::tests::discover_gate_filters_the_advert_push_per_viewer
2026-08-18T00:58:25.4558204Z 
2026-08-18T00:58:25.4558504Z     test result: FAILED. 0 passed; 1 failed; 0 ignored; 0 measured; 834 filtered out; finished in 0.02s
2026-08-18T00:58:25.4558899Z 
2026-08-18T00:58:25.4559016Z   stderr ───
2026-08-18T00:58:25.4559125Z 
2026-08-18T00:58:25.4559614Z     thread 'pump::registry::tests::discover_gate_filters_the_advert_push_per_viewer' (29144) panicked at crates\spt-daemon\src\pump\registry.rs:369:13:
2026-08-18T00:58:25.4560689Z     refused viewer is not told the endpoint exists: {"subnet":"home","endpoint_id":"ling","instance":{"node":"me","status":"Active","epoch":1,"resources":"ling builds rust","bound":true}}
2026-08-18T00:58:25.4561717Z     {"subnet":"home","endpoint_id":"doyle","instance":{"node":"me","status":"Active","epoch":1,"resources":"doyle builds rust","bound":true}}
2026-08-18T00:58:25.4562346Z     {"subnet":"home","node":"me","label":"hfenduleam","epoch":1}
2026-08-18T00:58:25.4562591Z 
2026-08-18T00:58:25.4562806Z     note: run with `RUST_BACKTRACE=1` environment variable to display a backtrace
2026-08-18T00:58:25.4563107Z 
2026-08-18T00:58:25.4563252Z   Cancelling due to test failure: 15 tests still running
2026-08-18T00:58:25.4842415Z         PASS [   0.119s] ( 979/2564) spt-daemon pump::registry::tests::disclosable_lines_pushes_the_engine_room_only_to_its_chosen_viewer
2026-08-18T00:58:25.5363178Z         PASS [   0.075s] ( 980/2564) spt-daemon pump::registry::tests::poll_wake_takes_the_advertise_marker_exactly_once
2026-08-18T00:58:25.5591837Z         PASS [   0.140s] ( 981/2564) spt-daemon pump::registry::tests::fire_due_rotations_rotates_due_and_leaves_pending
2026-08-18T00:58:25.6293033Z         PASS [   3.566s] ( 982/2564) spt-daemon projwriter::tests::writer_thread_debounces_burst_into_one_cycle
2026-08-18T00:58:25.6319184Z         PASS [   3.603s] ( 983/2564) spt-daemon projwriter::tests::ordinary_commit_is_noop_config_change_rederives
2026-08-18T00:58:25.7177107Z         PASS [   0.266s] ( 984/2564) spt-daemon pump::registry::tests::pre_round_sweeps_and_refreshes_adverts_each_round
2026-08-18T00:58:25.7469519Z         PASS [   2.928s] ( 985/2564) spt-daemon psyrelay::tests::spoofed_routing_is_stripped_and_restamped
2026-08-18T00:58:25.9465620Z         PASS [   6.312s] ( 986/2564) spt-daemon lifecycle::tests::relative_commune_dir_resolves_against_endpoint_cwd_and_fills_project_branch
2026-08-18T00:58:26.4395758Z         PASS [   4.413s] ( 987/2564) spt-daemon projwriter::tests::failed_cycle_preserves_last_known_good
2026-08-18T00:58:26.5273969Z         PASS [   4.474s] ( 988/2564) spt-daemon projwriter::tests::warm_start_unchanged_generation_scans_nothing
2026-08-18T00:58:26.6374690Z         PASS [   4.612s] ( 989/2564) spt-daemon projwriter::tests::endpoint_events_patch_rows_and_drop_purged
2026-08-18T00:58:28.5547466Z         PASS [   6.591s] ( 990/2564) spt-daemon projwriter::tests::batched_complexity_counters_hold
2026-08-18T00:58:30.4969712Z         PASS [   8.449s] ( 991/2564) spt-daemon projwriter::tests::parity_full_ordered_list_vs_legacy_oracle
2026-08-18T00:58:30.5931464Z         PASS [  21.609s] ( 992/2564) spt::bin/spt api::startup::tests::a_listener_over_a_dead_pty_is_not_offlined_by_the_liveness_reconcile
2026-08-18T00:58:30.6467853Z         PASS [  19.582s] ( 993/2564) spt::bin/spt cli::tests::owner_shutdown_gated_by_can_shutdown_grant
2026-08-18T00:58:30.6470304Z ────────────
2026-08-18T00:58:30.6470934Z      Summary [  22.631s] 993/2564 tests run: 992 passed (4 leaky), 1 failed, 1 skipped
2026-08-18T00:58:30.6471332Z         FAIL [   0.038s] ( 978/2564) spt-daemon pump::registry::tests::discover_gate_filters_the_advert_push_per_viewer
2026-08-18T00:58:30.6471863Z warning: 1571/2564 tests were not run due to test failure (run with --no-fail-fast to run all tests, or run with --max-fail)
2026-08-18T00:58:30.6537769Z error: test run failed
2026-08-18T00:58:35.7726892Z ##[error]Process completed with exit code 1.
2026-08-18T00:58:35.8058158Z Post job cleanup.
2026-08-18T00:58:36.0295756Z [command]"C:\Program Files\Git\cmd\git.exe" version
2026-08-18T00:58:36.0797564Z git version 2.43.0.windows.1
2026-08-18T00:58:36.0842674Z Copying 'C:\Users\decid\.gitconfig' to 'C:\actions-runner\_work\_temp\57fc1796-c12e-4906-8e9e-a1134a309008\.gitconfig'
2026-08-18T00:58:36.0864369Z Temporarily overriding HOME='C:\actions-runner\_work\_temp\57fc1796-c12e-4906-8e9e-a1134a309008' before making global git config changes
2026-08-18T00:58:36.0865200Z Adding repository directory to the temporary git global config as a safe directory
2026-08-18T00:58:36.0872057Z [command]"C:\Program Files\Git\cmd\git.exe" config --global --add safe.directory C:\actions-runner\_work\spt-bs-core\spt-bs-core
2026-08-18T00:58:36.1127171Z [command]"C:\Program Files\Git\cmd\git.exe" config --local --name-only --get-regexp core\.sshCommand
2026-08-18T00:58:36.1365323Z [command]"C:\Program Files\Git\cmd\git.exe" submodule foreach --recursive "sh -c \"git config --local --name-only --get-regexp 'core\.sshCommand' && git config --local --unset-all 'core.sshCommand' || :\""
2026-08-18T00:58:36.6752430Z [command]"C:\Program Files\Git\cmd\git.exe" config --local --name-only --get-regexp http\.https\:\/\/github\.com\/\.extraheader
2026-08-18T00:58:36.7423196Z http.https://github.com/.extraheader
2026-08-18T00:58:36.7455613Z [command]"C:\Program Files\Git\cmd\git.exe" config --local --unset-all http.https://github.com/.extraheader
2026-08-18T00:58:36.7766777Z [command]"C:\Program Files\Git\cmd\git.exe" submodule foreach --recursive "sh -c \"git config --local --name-only --get-regexp 'http\.https\:\/\/github\.com\/\.extraheader' && git config --local --unset-all 'http.https://github.com/.extraheader' || :\""
2026-08-18T00:58:37.3117168Z [command]"C:\Program Files\Git\cmd\git.exe" config --local --name-only --get-regexp ^includeIf\.gitdir:
2026-08-18T00:58:37.3370161Z [command]"C:\Program Files\Git\cmd\git.exe" submodule foreach --recursive "git config --local --show-origin --name-only --get-regexp remote.origin.url"
2026-08-18T00:58:37.8647716Z Cleaning up orphan processes
2026-08-18T00:58:37.9020145Z Terminate orphan process: pid (49860) (PING)
2026-08-18T00:58:37.9076159Z Terminate orphan process: pid (50252) (PING)
2026-08-18T00:58:37.9131834Z Terminate orphan process: pid (33128) (PING)
2026-08-18T00:58:37.9195328Z Terminate orphan process: pid (10032) (PING)
